{"text_format":"2","workbook":"ods","n_sheets":10,"sheets":["111_Q1名單","111_Q1名單_(英)","'file:///D:/公司/公司用/交易部SOP/交易部/權證相關/標的證券/111年度權證標的/標的證券(111Q1_1101230公告)/1101230底稿.xlsx'#全部","'file:///D:/公司/公司用/交易部SOP/交易部/權證相關/標的證券/111年度權證標的/標的證券(111Q1_1101230公告)/1101230底稿.xlsx'#合乎標準","'file:///D:/公司/公司用/交易部SOP/交易部/權證相關/標的證券/111年度權證標的/標的證券(111Q1_1101230公告)/1101230底稿.xlsx'#111_Q1名單","'file:///D:/公司/公司用/交易部SOP/交易部/權證相關/標的證券/111年度權證標的/標的證券(111Q1_1101230公告)/1101230底稿.xlsx'#111_Q1名單_(英)","'file:///D:/公司/公司用/交易部SOP/交易部/權證相關/標的證券/111年度權證標的/標的證券(111Q1_1101230公告)/1101230底稿.xlsx'#增減名單","'file:///D:/公司/公司用/交易部SOP/交易部/權證相關/標的證券/111年度權證標的/標的證券(111Q1_1101230公告)/1101230底稿.xlsx'#刪除名單原因","'file:///D:/公司/公司用/交易部SOP/交易部/權證相關/標的證券/111年度權證標的/標的證券(111Q1_1101230公告)/1101230底稿.xlsx'#增減名單底稿","'file:///D:/公司/公司用/交易部SOP/交易部/權證相關/標的證券/111年度權證標的/標的證券(111Q1_1101230公告)/1101230底稿.xlsx'#上櫃公司基本資料"],"not_rendered":{"charts":0,"images":0,"macros":0,"external_links":8,"defined_names":3,"comments":0,"pivot_tables":0},"unopened":[],"bounds":{"document_bytes":16777216,"sheet_cells":100000,"run_cost":"one","rows_first":2000,"rows_last":500,"rows_between":2000,"halvings":0,"cell_chars":16384,"cell_head_chars":4096},"cells_cut":0,"cells_raw":0,"read":"whole","date_system":"iso_in_file"}

{"sheet":"111_Q1名單","index":0,"n_rows":81,"n_cols":6,"rows_kept":81,"cut":false,"hidden":false,"merged":[[0,0,0,5],[1,0,1,5],[2,0,2,5],[63,0,63,5]]}
["111年第1季認購(售)權證(含牛熊證)標的證券共219種"]
["有效期間：111年1月1日至111年3月31日"]
[{"$f":"of:=CONCATENATE(\"表一：所有發行人可發行標的（共 \";COUNT([.A5:.F62]);\" 種）\")","v":"表一：所有發行人可發行標的（共 172 種）"}]
["公司代號","公司名稱","公司代號","公司名稱","公司代號","公司名稱"]
[1565,"精華",1580,"新麥",1785,"光洋科"]
[1815,"富喬",2641,"正德",2732,"六角"]
[3078,"僑威",3081,"聯亞",3088,"艾訊"]
[3105,"穩懋",3131,"弘塑",3141,"晶宏"]
[3152,"璟德",3162,"精確",3169,"亞信"]
[3176,"基亞",3211,"順達",3217,"優群"]
[3218,"大學光",3221,"台嘉碩",3227,"原相"]
[3228,"金麗科",3260,"威剛",3264,"欣銓"]
[3265,"台星科",3289,"宜特",3293,"鈊象"]
[3294,"英濟",3317,"尼克森",3324,"雙鴻"]
[3357,"臺慶科",3362,"先進光",3372,"典範"]
[3374,"精材",3438,"類比科",3455,"由田"]
[3465,"進泰",3479,"安勤",3483,"力致"]
[3484,"崧騰",3491,"昇達科",3526,"凡甲"]
[3527,"聚積",3529,"力旺",3546,"宇峻"]
[3551,"世禾",3552,"同致",3556,"禾瑞亞"]
[3558,"神準",3587,"閎康",3624,"光頡"]
[3675,"德微",3680,"家登",3687,"歐買尬"]
[3691,"碩禾",3707,"漢磊",4105,"東洋"]
[4107,"邦特",4114,"健喬",4123,"晟德"]
[4126,"太醫",4157,"太景*",4162,"智擎"]
[4707,"磐亞",4721,"美琪瑪",4736,"泰博"]
[4953,"緯軟",4966,"譜瑞",4974,"亞泰"]
[5009,"榮剛",5236,"凌陽創",5274,"信驊"]
[5289,"宜鼎",5299,"杰力",5309,"系統電"]
[5347,"世界",5351,"鈺創",5371,"中光電"]
[5392,"能率",5425,"台半",5439,"高技"]
[5443,"均豪",5457,"宣德",5474,"聰泰"]
[5475,"德宏",5478,"智冠",5483,"中美晶"]
[5536,"聖暉",5609,"中菲行",6015,"宏遠證"]
[6016,"康和證",6026,"福邦證",6104,"創惟"]
[6111,"大宇資",6118,"建達",6121,"新普"]
[6125,"廣運",6129,"普誠",6138,"茂達"]
[6143,"振曜",6147,"頎邦",6150,"撼訊"]
[6173,"信昌電",6175,"立敦",6180,"橘子"]
[6182,"合晶",6187,"萬潤",6188,"廣明"]
[6190,"萬泰科",6203,"海韻電",6208,"日揚"]
[6223,"旺矽",6237,"驊訊",6244,"茂迪"]
[6245,"立端",6261,"久元",6274,"台燿"]
[6279,"胡連",6284,"佳邦",6290,"良維"]
[6411,"晶焱",6435,"大中",6457,"紘康"]
[6462,"神盾",6469,"大樹",6472,"保瑞"]
[6485,"點序",6488,"環球晶",6494,"九齊"]
[6499,"益安",6509,"聚和",6510,"精測"]
[6516,"勤崴",6523,"達爾膚",6535,"順藥"]
[6547,"高端",6548,"長科*",6568,"宏觀"]
[6643,"M31",6664,"群翊",6679,"鈺太"]
[6683,"雍智",6684,"安格",6712,"長聖"]
[6732,"昇佳電",6741,"91APP*",6747,"亨泰光"]
[6788,"華景電",8027,"鈦昇",8040,"九暘"]
[8044,"網家",8054,"安國",8069,"元太"]
[8076,"伍豐",8086,"宏捷科",8121,"越峰"]
[8155,"博智",8182,"加高",8183,"精星"]
[8255,"朋程",8299,"群聯",8358,"金居"]
[8383,"千附",8390,"金益鼎",8406,"金可"]
[8415,"大國鋼",8436,"大江",8924,"大田"]
[8927,"北基",8936,"國統",8938,"明安"]
[8942,"森鉅"]
[]
[{"$f":"of:=CONCATENATE(\"表二：Ａ級發行人可發行標的（共 \";COUNT([.A66:.F81]);\" 種）\")","v":"表二：Ａ級發行人可發行標的（共 47 種）"}]
["公司代號","公司名稱","公司代號","公司名稱","公司代號","公司名稱"]
[1569,"濱川",1586,"和勤",1599,"宏佳騰"]
[2754,"藏壽司",3071,"協禧",3163,"波若威"]
[3178,"公準",3213,"茂訊",3323,"加百裕"]
[3402,"漢科",3511,"矽瑪",3540,"曜越"]
[3541,"西柏",3548,"兆利",3577,"泓格"]
[3689,"湧德",3709,"鑫聯",4171,"瑞基"]
[4760,"勤凱",4933,"友輝",5014,"建錩"]
[5245,"智晶",5312,"寶島科",5321,"美而快"]
[5344,"立衛",5383,"金利",5452,"佶優"]
[6126,"信音",6127,"九豪",6170,"統振"]
[6186,"新潤",6207,"雷科",6217,"中探針"]
[6231,"系微",6538,"倉和",6651,"全宇昕"]
[6654,"天正",6667,"信紘科",6716,"應廣"]
[6761,"穩得",8049,"晶采",8064,"東捷"]
[8091,"翔名",8099,"大世科",8111,"立碁"]
[8431,"匯鑽科",8933,"愛地雅"]

{"sheet":"111_Q1名單_(英)","index":1,"n_rows":82,"n_cols":6,"rows_kept":82,"cut":false,"hidden":false,"merged":[[0,0,0,5],[1,0,1,5],[2,0,2,5],[64,0,64,5]]}
["List of approved underlying securities for issuing warrants\n(including CBBC) during 1Q 2022 (total 219)"]
["Effective from 1 January 2022 to 31 March 2022 "]
[{"$f":"of:=CONCATENATE(\"Chart-1：\";COUNT([.A5:.F62]);\" TPEx-listed securities for all issuers\")","v":"Chart-1：172 TPEx-listed securities for all issuers"}]
["Code","Company Name","Code","Company Name","Code","Company Name"]
[1565,{"$f":"of:=IFERROR(VLOOKUP([.A5];['file:///D:/公司/公司用/交易部SOP/交易部/權證相關/標的證券/111年度權證標的/標的證券(111Q1_1101230公告)/1101230底稿.xlsx'#上櫃公司基本資料.$A:.$C];3;FALSE);\"找不到\")","v":"St.Shine　"},1580,{"$f":"of:=IFERROR(VLOOKUP([.C5];['file:///D:/公司/公司用/交易部SOP/交易部/權證相關/標的證券/111年度權證標的/標的證券(111Q1_1101230公告)/1101230底稿.xlsx'#上櫃公司基本資料.$A:.$C];3;FALSE);\"找不到\")","v":"SINMAG"},1785,{"$f":"of:=IFERROR(VLOOKUP([.E5];['file:///D:/公司/公司用/交易部SOP/交易部/權證相關/標的證券/111年度權證標的/標的證券(111Q1_1101230公告)/1101230底稿.xlsx'#上櫃公司基本資料.$A:.$C];3;FALSE);\"找不到\")","v":"Solar"}]
[1815,{"$f":"of:=IFERROR(VLOOKUP([.A6];['file:///D:/公司/公司用/交易部SOP/交易部/權證相關/標的證券/111年度權證標的/標的證券(111Q1_1101230公告)/1101230底稿.xlsx'#上櫃公司基本資料.$A:.$C];3;FALSE);\"找不到\")","v":"FFG"},2641,{"$f":"of:=IFERROR(VLOOKUP([.C6];['file:///D:/公司/公司用/交易部SOP/交易部/權證相關/標的證券/111年度權證標的/標的證券(111Q1_1101230公告)/1101230底稿.xlsx'#上櫃公司基本資料.$A:.$C];3;FALSE);\"找不到\")","v":"Franbo Lines"},2732,{"$f":"of:=IFERROR(VLOOKUP([.E6];['file:///D:/公司/公司用/交易部SOP/交易部/權證相關/標的證券/111年度權證標的/標的證券(111Q1_1101230公告)/1101230底稿.xlsx'#上櫃公司基本資料.$A:.$C];3;FALSE);\"找不到\")","v":"La Kaffa"}]
[3078,{"$f":"of:=IFERROR(VLOOKUP([.A7];['file:///D:/公司/公司用/交易部SOP/交易部/權證相關/標的證券/111年度權證標的/標的證券(111Q1_1101230公告)/1101230底稿.xlsx'#上櫃公司基本資料.$A:.$C];3;FALSE);\"找不到\")","v":"CWT　　"},3081,{"$f":"of:=IFERROR(VLOOKUP([.C7];['file:///D:/公司/公司用/交易部SOP/交易部/權證相關/標的證券/111年度權證標的/標的證券(111Q1_1101230公告)/1101230底稿.xlsx'#上櫃公司基本資料.$A:.$C];3;FALSE);\"找不到\")","v":"LandMark"},3088,{"$f":"of:=IFERROR(VLOOKUP([.E7];['file:///D:/公司/公司用/交易部SOP/交易部/權證相關/標的證券/111年度權證標的/標的證券(111Q1_1101230公告)/1101230底稿.xlsx'#上櫃公司基本資料.$A:.$C];3;FALSE);\"找不到\")","v":"AXIOMTEK"}]
[3105,{"$f":"of:=IFERROR(VLOOKUP([.A8];['file:///D:/公司/公司用/交易部SOP/交易部/權證相關/標的證券/111年度權證標的/標的證券(111Q1_1101230公告)/1101230底稿.xlsx'#上櫃公司基本資料.$A:.$C];3;FALSE);\"找不到\")","v":"WIN　　"},3131,{"$f":"of:=IFERROR(VLOOKUP([.C8];['file:///D:/公司/公司用/交易部SOP/交易部/權證相關/標的證券/111年度權證標的/標的證券(111Q1_1101230公告)/1101230底稿.xlsx'#上櫃公司基本資料.$A:.$C];3;FALSE);\"找不到\")","v":"GPTC"},3141,{"$f":"of:=IFERROR(VLOOKUP([.E8];['file:///D:/公司/公司用/交易部SOP/交易部/權證相關/標的證券/111年度權證標的/標的證券(111Q1_1101230公告)/1101230底稿.xlsx'#上櫃公司基本資料.$A:.$C];3;FALSE);\"找不到\")","v":"UltraChip"}]
[3152,{"$f":"of:=IFERROR(VLOOKUP([.A9];['file:///D:/公司/公司用/交易部SOP/交易部/權證相關/標的證券/111年度權證標的/標的證券(111Q1_1101230公告)/1101230底稿.xlsx'#上櫃公司基本資料.$A:.$C];3;FALSE);\"找不到\")","v":"ACX"},3162,{"$f":"of:=IFERROR(VLOOKUP([.C9];['file:///D:/公司/公司用/交易部SOP/交易部/權證相關/標的證券/111年度權證標的/標的證券(111Q1_1101230公告)/1101230底稿.xlsx'#上櫃公司基本資料.$A:.$C];3;FALSE);\"找不到\")","v":"UAT"},3169,{"$f":"of:=IFERROR(VLOOKUP([.E9];['file:///D:/公司/公司用/交易部SOP/交易部/權證相關/標的證券/111年度權證標的/標的證券(111Q1_1101230公告)/1101230底稿.xlsx'#上櫃公司基本資料.$A:.$C];3;FALSE);\"找不到\")","v":"ASIX　　"}]
[3176,{"$f":"of:=IFERROR(VLOOKUP([.A10];['file:///D:/公司/公司用/交易部SOP/交易部/權證相關/標的證券/111年度權證標的/標的證券(111Q1_1101230公告)/1101230底稿.xlsx'#上櫃公司基本資料.$A:.$C];3;FALSE);\"找不到\")","v":"MEDIGEN　　"},3211,{"$f":"of:=IFERROR(VLOOKUP([.C10];['file:///D:/公司/公司用/交易部SOP/交易部/權證相關/標的證券/111年度權證標的/標的證券(111Q1_1101230公告)/1101230底稿.xlsx'#上櫃公司基本資料.$A:.$C];3;FALSE);\"找不到\")","v":"Dynapack"},3217,{"$f":"of:=IFERROR(VLOOKUP([.E10];['file:///D:/公司/公司用/交易部SOP/交易部/權證相關/標的證券/111年度權證標的/標的證券(111Q1_1101230公告)/1101230底稿.xlsx'#上櫃公司基本資料.$A:.$C];3;FALSE);\"找不到\")","v":"ARGOSY"}]
[3218,{"$f":"of:=IFERROR(VLOOKUP([.A11];['file:///D:/公司/公司用/交易部SOP/交易部/權證相關/標的證券/111年度權證標的/標的證券(111Q1_1101230公告)/1101230底稿.xlsx'#上櫃公司基本資料.$A:.$C];3;FALSE);\"找不到\")","v":"UNIVERSAL"},3221,{"$f":"of:=IFERROR(VLOOKUP([.C11];['file:///D:/公司/公司用/交易部SOP/交易部/權證相關/標的證券/111年度權證標的/標的證券(111Q1_1101230公告)/1101230底稿.xlsx'#上櫃公司基本資料.$A:.$C];3;FALSE);\"找不到\")","v":"TST"},3227,{"$f":"of:=IFERROR(VLOOKUP([.E11];['file:///D:/公司/公司用/交易部SOP/交易部/權證相關/標的證券/111年度權證標的/標的證券(111Q1_1101230公告)/1101230底稿.xlsx'#上櫃公司基本資料.$A:.$C];3;FALSE);\"找不到\")","v":"PXI"}]
[3228,{"$f":"of:=IFERROR(VLOOKUP([.A12];['file:///D:/公司/公司用/交易部SOP/交易部/權證相關/標的證券/111年度權證標的/標的證券(111Q1_1101230公告)/1101230底稿.xlsx'#上櫃公司基本資料.$A:.$C];3;FALSE);\"找不到\")","v":"RDC"},3260,{"$f":"of:=IFERROR(VLOOKUP([.C12];['file:///D:/公司/公司用/交易部SOP/交易部/權證相關/標的證券/111年度權證標的/標的證券(111Q1_1101230公告)/1101230底稿.xlsx'#上櫃公司基本資料.$A:.$C];3;FALSE);\"找不到\")","v":"ADATA"},3264,{"$f":"of:=IFERROR(VLOOKUP([.E12];['file:///D:/公司/公司用/交易部SOP/交易部/權證相關/標的證券/111年度權證標的/標的證券(111Q1_1101230公告)/1101230底稿.xlsx'#上櫃公司基本資料.$A:.$C];3;FALSE);\"找不到\")","v":"Ardentec"}]
[3265,{"$f":"of:=IFERROR(VLOOKUP([.A13];['file:///D:/公司/公司用/交易部SOP/交易部/權證相關/標的證券/111年度權證標的/標的證券(111Q1_1101230公告)/1101230底稿.xlsx'#上櫃公司基本資料.$A:.$C];3;FALSE);\"找不到\")","v":"WST"},3289,{"$f":"of:=IFERROR(VLOOKUP([.C13];['file:///D:/公司/公司用/交易部SOP/交易部/權證相關/標的證券/111年度權證標的/標的證券(111Q1_1101230公告)/1101230底稿.xlsx'#上櫃公司基本資料.$A:.$C];3;FALSE);\"找不到\")","v":"IST"},3293,{"$f":"of:=IFERROR(VLOOKUP([.E13];['file:///D:/公司/公司用/交易部SOP/交易部/權證相關/標的證券/111年度權證標的/標的證券(111Q1_1101230公告)/1101230底稿.xlsx'#上櫃公司基本資料.$A:.$C];3;FALSE);\"找不到\")","v":"IGS"}]
[3294,{"$f":"of:=IFERROR(VLOOKUP([.A14];['file:///D:/公司/公司用/交易部SOP/交易部/權證相關/標的證券/111年度權證標的/標的證券(111Q1_1101230公告)/1101230底稿.xlsx'#上櫃公司基本資料.$A:.$C];3;FALSE);\"找不到\")","v":"Megaforce"},3317,{"$f":"of:=IFERROR(VLOOKUP([.C14];['file:///D:/公司/公司用/交易部SOP/交易部/權證相關/標的證券/111年度權證標的/標的證券(111Q1_1101230公告)/1101230底稿.xlsx'#上櫃公司基本資料.$A:.$C];3;FALSE);\"找不到\")","v":"NIKO-SEM"},3324,{"$f":"of:=IFERROR(VLOOKUP([.E14];['file:///D:/公司/公司用/交易部SOP/交易部/權證相關/標的證券/111年度權證標的/標的證券(111Q1_1101230公告)/1101230底稿.xlsx'#上櫃公司基本資料.$A:.$C];3;FALSE);\"找不到\")","v":"AURAS"}]
[3357,{"$f":"of:=IFERROR(VLOOKUP([.A15];['file:///D:/公司/公司用/交易部SOP/交易部/權證相關/標的證券/111年度權證標的/標的證券(111Q1_1101230公告)/1101230底稿.xlsx'#上櫃公司基本資料.$A:.$C];3;FALSE);\"找不到\")","v":"TAI-TECH"},3362,{"$f":"of:=IFERROR(VLOOKUP([.C15];['file:///D:/公司/公司用/交易部SOP/交易部/權證相關/標的證券/111年度權證標的/標的證券(111Q1_1101230公告)/1101230底稿.xlsx'#上櫃公司基本資料.$A:.$C];3;FALSE);\"找不到\")","v":"ABILITY"},3372,{"$f":"of:=IFERROR(VLOOKUP([.E15];['file:///D:/公司/公司用/交易部SOP/交易部/權證相關/標的證券/111年度權證標的/標的證券(111Q1_1101230公告)/1101230底稿.xlsx'#上櫃公司基本資料.$A:.$C];3;FALSE);\"找不到\")","v":"TICP"}]
[3374,{"$f":"of:=IFERROR(VLOOKUP([.A16];['file:///D:/公司/公司用/交易部SOP/交易部/權證相關/標的證券/111年度權證標的/標的證券(111Q1_1101230公告)/1101230底稿.xlsx'#上櫃公司基本資料.$A:.$C];3;FALSE);\"找不到\")","v":"Xintec"},3438,{"$f":"of:=IFERROR(VLOOKUP([.C16];['file:///D:/公司/公司用/交易部SOP/交易部/權證相關/標的證券/111年度權證標的/標的證券(111Q1_1101230公告)/1101230底稿.xlsx'#上櫃公司基本資料.$A:.$C];3;FALSE);\"找不到\")","v":"AAT"},3455,{"$f":"of:=IFERROR(VLOOKUP([.E16];['file:///D:/公司/公司用/交易部SOP/交易部/權證相關/標的證券/111年度權證標的/標的證券(111Q1_1101230公告)/1101230底稿.xlsx'#上櫃公司基本資料.$A:.$C];3;FALSE);\"找不到\")","v":"UTECHZONE"}]
[3465,{"$f":"of:=IFERROR(VLOOKUP([.A17];['file:///D:/公司/公司用/交易部SOP/交易部/權證相關/標的證券/111年度權證標的/標的證券(111Q1_1101230公告)/1101230底稿.xlsx'#上櫃公司基本資料.$A:.$C];3;FALSE);\"找不到\")","v":"NAE"},3479,{"$f":"of:=IFERROR(VLOOKUP([.C17];['file:///D:/公司/公司用/交易部SOP/交易部/權證相關/標的證券/111年度權證標的/標的證券(111Q1_1101230公告)/1101230底稿.xlsx'#上櫃公司基本資料.$A:.$C];3;FALSE);\"找不到\")","v":"Avalue"},3483,{"$f":"of:=IFERROR(VLOOKUP([.E17];['file:///D:/公司/公司用/交易部SOP/交易部/權證相關/標的證券/111年度權證標的/標的證券(111Q1_1101230公告)/1101230底稿.xlsx'#上櫃公司基本資料.$A:.$C];3;FALSE);\"找不到\")","v":"FCN"}]
[3484,{"$f":"of:=IFERROR(VLOOKUP([.A18];['file:///D:/公司/公司用/交易部SOP/交易部/權證相關/標的證券/111年度權證標的/標的證券(111Q1_1101230公告)/1101230底稿.xlsx'#上櫃公司基本資料.$A:.$C];3;FALSE);\"找不到\")","v":"SOLTEAM"},3491,{"$f":"of:=IFERROR(VLOOKUP([.C18];['file:///D:/公司/公司用/交易部SOP/交易部/權證相關/標的證券/111年度權證標的/標的證券(111Q1_1101230公告)/1101230底稿.xlsx'#上櫃公司基本資料.$A:.$C];3;FALSE);\"找不到\")","v":"UMT"},3526,{"$f":"of:=IFERROR(VLOOKUP([.E18];['file:///D:/公司/公司用/交易部SOP/交易部/權證相關/標的證券/111年度權證標的/標的證券(111Q1_1101230公告)/1101230底稿.xlsx'#上櫃公司基本資料.$A:.$C];3;FALSE);\"找不到\")","v":"ALLTOP"}]
[3527,{"$f":"of:=IFERROR(VLOOKUP([.A19];['file:///D:/公司/公司用/交易部SOP/交易部/權證相關/標的證券/111年度權證標的/標的證券(111Q1_1101230公告)/1101230底稿.xlsx'#上櫃公司基本資料.$A:.$C];3;FALSE);\"找不到\")","v":"MBI"},3529,{"$f":"of:=IFERROR(VLOOKUP([.C19];['file:///D:/公司/公司用/交易部SOP/交易部/權證相關/標的證券/111年度權證標的/標的證券(111Q1_1101230公告)/1101230底稿.xlsx'#上櫃公司基本資料.$A:.$C];3;FALSE);\"找不到\")","v":"eMemory"},3546,{"$f":"of:=IFERROR(VLOOKUP([.E19];['file:///D:/公司/公司用/交易部SOP/交易部/權證相關/標的證券/111年度權證標的/標的證券(111Q1_1101230公告)/1101230底稿.xlsx'#上櫃公司基本資料.$A:.$C];3;FALSE);\"找不到\")","v":"USERJOY"}]
[3551,{"$f":"of:=IFERROR(VLOOKUP([.A20];['file:///D:/公司/公司用/交易部SOP/交易部/權證相關/標的證券/111年度權證標的/標的證券(111Q1_1101230公告)/1101230底稿.xlsx'#上櫃公司基本資料.$A:.$C];3;FALSE);\"找不到\")","v":"SHT"},3552,{"$f":"of:=IFERROR(VLOOKUP([.C20];['file:///D:/公司/公司用/交易部SOP/交易部/權證相關/標的證券/111年度權證標的/標的證券(111Q1_1101230公告)/1101230底稿.xlsx'#上櫃公司基本資料.$A:.$C];3;FALSE);\"找不到\")","v":"TUNG THIH"},3556,{"$f":"of:=IFERROR(VLOOKUP([.E20];['file:///D:/公司/公司用/交易部SOP/交易部/權證相關/標的證券/111年度權證標的/標的證券(111Q1_1101230公告)/1101230底稿.xlsx'#上櫃公司基本資料.$A:.$C];3;FALSE);\"找不到\")","v":"EETI"}]
[3558,{"$f":"of:=IFERROR(VLOOKUP([.A21];['file:///D:/公司/公司用/交易部SOP/交易部/權證相關/標的證券/111年度權證標的/標的證券(111Q1_1101230公告)/1101230底稿.xlsx'#上櫃公司基本資料.$A:.$C];3;FALSE);\"找不到\")","v":"Senao Networks"},3587,{"$f":"of:=IFERROR(VLOOKUP([.C21];['file:///D:/公司/公司用/交易部SOP/交易部/權證相關/標的證券/111年度權證標的/標的證券(111Q1_1101230公告)/1101230底稿.xlsx'#上櫃公司基本資料.$A:.$C];3;FALSE);\"找不到\")","v":"MA-tek"},3624,{"$f":"of:=IFERROR(VLOOKUP([.E21];['file:///D:/公司/公司用/交易部SOP/交易部/權證相關/標的證券/111年度權證標的/標的證券(111Q1_1101230公告)/1101230底稿.xlsx'#上櫃公司基本資料.$A:.$C];3;FALSE);\"找不到\")","v":"VIKING"}]
[3675,{"$f":"of:=IFERROR(VLOOKUP([.A22];['file:///D:/公司/公司用/交易部SOP/交易部/權證相關/標的證券/111年度權證標的/標的證券(111Q1_1101230公告)/1101230底稿.xlsx'#上櫃公司基本資料.$A:.$C];3;FALSE);\"找不到\")","v":"Eris Tech"},3680,{"$f":"of:=IFERROR(VLOOKUP([.C22];['file:///D:/公司/公司用/交易部SOP/交易部/權證相關/標的證券/111年度權證標的/標的證券(111Q1_1101230公告)/1101230底稿.xlsx'#上櫃公司基本資料.$A:.$C];3;FALSE);\"找不到\")","v":"Gudeng"},3687,{"$f":"of:=IFERROR(VLOOKUP([.E22];['file:///D:/公司/公司用/交易部SOP/交易部/權證相關/標的證券/111年度權證標的/標的證券(111Q1_1101230公告)/1101230底稿.xlsx'#上櫃公司基本資料.$A:.$C];3;FALSE);\"找不到\")","v":"OMG"}]
[3691,{"$f":"of:=IFERROR(VLOOKUP([.A23];['file:///D:/公司/公司用/交易部SOP/交易部/權證相關/標的證券/111年度權證標的/標的證券(111Q1_1101230公告)/1101230底稿.xlsx'#上櫃公司基本資料.$A:.$C];3;FALSE);\"找不到\")","v":"GIGASOLAR"},3707,{"$f":"of:=IFERROR(VLOOKUP([.C23];['file:///D:/公司/公司用/交易部SOP/交易部/權證相關/標的證券/111年度權證標的/標的證券(111Q1_1101230公告)/1101230底稿.xlsx'#上櫃公司基本資料.$A:.$C];3;FALSE);\"找不到\")","v":"EPISIL"},4105,{"$f":"of:=IFERROR(VLOOKUP([.E23];['file:///D:/公司/公司用/交易部SOP/交易部/權證相關/標的證券/111年度權證標的/標的證券(111Q1_1101230公告)/1101230底稿.xlsx'#上櫃公司基本資料.$A:.$C];3;FALSE);\"找不到\")","v":"TTY　"}]
[4107,{"$f":"of:=IFERROR(VLOOKUP([.A24];['file:///D:/公司/公司用/交易部SOP/交易部/權證相關/標的證券/111年度權證標的/標的證券(111Q1_1101230公告)/1101230底稿.xlsx'#上櫃公司基本資料.$A:.$C];3;FALSE);\"找不到\")","v":"BIOTEQUE"},4114,{"$f":"of:=IFERROR(VLOOKUP([.C24];['file:///D:/公司/公司用/交易部SOP/交易部/權證相關/標的證券/111年度權證標的/標的證券(111Q1_1101230公告)/1101230底稿.xlsx'#上櫃公司基本資料.$A:.$C];3;FALSE);\"找不到\")","v":"SYNMOSA"},4123,{"$f":"of:=IFERROR(VLOOKUP([.E24];['file:///D:/公司/公司用/交易部SOP/交易部/權證相關/標的證券/111年度權證標的/標的證券(111Q1_1101230公告)/1101230底稿.xlsx'#上櫃公司基本資料.$A:.$C];3;FALSE);\"找不到\")","v":"Center Lab."}]
[4126,{"$f":"of:=IFERROR(VLOOKUP([.A25];['file:///D:/公司/公司用/交易部SOP/交易部/權證相關/標的證券/111年度權證標的/標的證券(111Q1_1101230公告)/1101230底稿.xlsx'#上櫃公司基本資料.$A:.$C];3;FALSE);\"找不到\")","v":"PAHSCO　　"},4157,{"$f":"of:=IFERROR(VLOOKUP([.C25];['file:///D:/公司/公司用/交易部SOP/交易部/權證相關/標的證券/111年度權證標的/標的證券(111Q1_1101230公告)/1101230底稿.xlsx'#上櫃公司基本資料.$A:.$C];3;FALSE);\"找不到\")","v":"TAIGEN"},4162,{"$f":"of:=IFERROR(VLOOKUP([.E25];['file:///D:/公司/公司用/交易部SOP/交易部/權證相關/標的證券/111年度權證標的/標的證券(111Q1_1101230公告)/1101230底稿.xlsx'#上櫃公司基本資料.$A:.$C];3;FALSE);\"找不到\")","v":"PEI"}]
[4707,{"$f":"of:=IFERROR(VLOOKUP([.A26];['file:///D:/公司/公司用/交易部SOP/交易部/權證相關/標的證券/111年度權證標的/標的證券(111Q1_1101230公告)/1101230底稿.xlsx'#上櫃公司基本資料.$A:.$C];3;FALSE);\"找不到\")","v":"PACC　　"},4721,{"$f":"of:=IFERROR(VLOOKUP([.C26];['file:///D:/公司/公司用/交易部SOP/交易部/權證相關/標的證券/111年度權證標的/標的證券(111Q1_1101230公告)/1101230底稿.xlsx'#上櫃公司基本資料.$A:.$C];3;FALSE);\"找不到\")","v":"mechema　"},4736,{"$f":"of:=IFERROR(VLOOKUP([.E26];['file:///D:/公司/公司用/交易部SOP/交易部/權證相關/標的證券/111年度權證標的/標的證券(111Q1_1101230公告)/1101230底稿.xlsx'#上櫃公司基本資料.$A:.$C];3;FALSE);\"找不到\")","v":"TaiDoc"}]
[4953,{"$f":"of:=IFERROR(VLOOKUP([.A27];['file:///D:/公司/公司用/交易部SOP/交易部/權證相關/標的證券/111年度權證標的/標的證券(111Q1_1101230公告)/1101230底稿.xlsx'#上櫃公司基本資料.$A:.$C];3;FALSE);\"找不到\")","v":"WITS"},4966,{"$f":"of:=IFERROR(VLOOKUP([.C27];['file:///D:/公司/公司用/交易部SOP/交易部/權證相關/標的證券/111年度權證標的/標的證券(111Q1_1101230公告)/1101230底稿.xlsx'#上櫃公司基本資料.$A:.$C];3;FALSE);\"找不到\")","v":"Parade"},4974,{"$f":"of:=IFERROR(VLOOKUP([.E27];['file:///D:/公司/公司用/交易部SOP/交易部/權證相關/標的證券/111年度權證標的/標的證券(111Q1_1101230公告)/1101230底稿.xlsx'#上櫃公司基本資料.$A:.$C];3;FALSE);\"找不到\")","v":"ATII"}]
[5009,{"$f":"of:=IFERROR(VLOOKUP([.A28];['file:///D:/公司/公司用/交易部SOP/交易部/權證相關/標的證券/111年度權證標的/標的證券(111Q1_1101230公告)/1101230底稿.xlsx'#上櫃公司基本資料.$A:.$C];3;FALSE);\"找不到\")","v":"GMTC　"},5236,{"$f":"of:=IFERROR(VLOOKUP([.C28];['file:///D:/公司/公司用/交易部SOP/交易部/權證相關/標的證券/111年度權證標的/標的證券(111Q1_1101230公告)/1101230底稿.xlsx'#上櫃公司基本資料.$A:.$C];3;FALSE);\"找不到\")","v":"Sunplusit"},5274,{"$f":"of:=IFERROR(VLOOKUP([.E28];['file:///D:/公司/公司用/交易部SOP/交易部/權證相關/標的證券/111年度權證標的/標的證券(111Q1_1101230公告)/1101230底稿.xlsx'#上櫃公司基本資料.$A:.$C];3;FALSE);\"找不到\")","v":"ASPEED"}]
[5289,{"$f":"of:=IFERROR(VLOOKUP([.A29];['file:///D:/公司/公司用/交易部SOP/交易部/權證相關/標的證券/111年度權證標的/標的證券(111Q1_1101230公告)/1101230底稿.xlsx'#上櫃公司基本資料.$A:.$C];3;FALSE);\"找不到\")","v":"Innodisk"},5299,{"$f":"of:=IFERROR(VLOOKUP([.C29];['file:///D:/公司/公司用/交易部SOP/交易部/權證相關/標的證券/111年度權證標的/標的證券(111Q1_1101230公告)/1101230底稿.xlsx'#上櫃公司基本資料.$A:.$C];3;FALSE);\"找不到\")","v":"EMC"},5309,{"$f":"of:=IFERROR(VLOOKUP([.E29];['file:///D:/公司/公司用/交易部SOP/交易部/權證相關/標的證券/111年度權證標的/標的證券(111Q1_1101230公告)/1101230底稿.xlsx'#上櫃公司基本資料.$A:.$C];3;FALSE);\"找不到\")","v":"SG　"}]
[5347,{"$f":"of:=IFERROR(VLOOKUP([.A30];['file:///D:/公司/公司用/交易部SOP/交易部/權證相關/標的證券/111年度權證標的/標的證券(111Q1_1101230公告)/1101230底稿.xlsx'#上櫃公司基本資料.$A:.$C];3;FALSE);\"找不到\")","v":"VIS"},5351,{"$f":"of:=IFERROR(VLOOKUP([.C30];['file:///D:/公司/公司用/交易部SOP/交易部/權證相關/標的證券/111年度權證標的/標的證券(111Q1_1101230公告)/1101230底稿.xlsx'#上櫃公司基本資料.$A:.$C];3;FALSE);\"找不到\")","v":"Etron　　"},5371,{"$f":"of:=IFERROR(VLOOKUP([.E30];['file:///D:/公司/公司用/交易部SOP/交易部/權證相關/標的證券/111年度權證標的/標的證券(111Q1_1101230公告)/1101230底稿.xlsx'#上櫃公司基本資料.$A:.$C];3;FALSE);\"找不到\")","v":"Coretronic　"}]
[5392,{"$f":"of:=IFERROR(VLOOKUP([.A31];['file:///D:/公司/公司用/交易部SOP/交易部/權證相關/標的證券/111年度權證標的/標的證券(111Q1_1101230公告)/1101230底稿.xlsx'#上櫃公司基本資料.$A:.$C];3;FALSE);\"找不到\")","v":"AVY"},5425,{"$f":"of:=IFERROR(VLOOKUP([.C31];['file:///D:/公司/公司用/交易部SOP/交易部/權證相關/標的證券/111年度權證標的/標的證券(111Q1_1101230公告)/1101230底稿.xlsx'#上櫃公司基本資料.$A:.$C];3;FALSE);\"找不到\")","v":"TSC　　"},5439,{"$f":"of:=IFERROR(VLOOKUP([.E31];['file:///D:/公司/公司用/交易部SOP/交易部/權證相關/標的證券/111年度權證標的/標的證券(111Q1_1101230公告)/1101230底稿.xlsx'#上櫃公司基本資料.$A:.$C];3;FALSE);\"找不到\")","v":"FHt"}]
[5443,{"$f":"of:=IFERROR(VLOOKUP([.A32];['file:///D:/公司/公司用/交易部SOP/交易部/權證相關/標的證券/111年度權證標的/標的證券(111Q1_1101230公告)/1101230底稿.xlsx'#上櫃公司基本資料.$A:.$C];3;FALSE);\"找不到\")","v":"GPM"},5457,{"$f":"of:=IFERROR(VLOOKUP([.C32];['file:///D:/公司/公司用/交易部SOP/交易部/權證相關/標的證券/111年度權證標的/標的證券(111Q1_1101230公告)/1101230底稿.xlsx'#上櫃公司基本資料.$A:.$C];3;FALSE);\"找不到\")","v":"SPEED TECH　"},5474,{"$f":"of:=IFERROR(VLOOKUP([.E32];['file:///D:/公司/公司用/交易部SOP/交易部/權證相關/標的證券/111年度權證標的/標的證券(111Q1_1101230公告)/1101230底稿.xlsx'#上櫃公司基本資料.$A:.$C];3;FALSE);\"找不到\")","v":"YUAN"}]
[5475,{"$f":"of:=IFERROR(VLOOKUP([.A33];['file:///D:/公司/公司用/交易部SOP/交易部/權證相關/標的證券/111年度權證標的/標的證券(111Q1_1101230公告)/1101230底稿.xlsx'#上櫃公司基本資料.$A:.$C];3;FALSE);\"找不到\")","v":"GLOTECH　　"},5478,{"$f":"of:=IFERROR(VLOOKUP([.C33];['file:///D:/公司/公司用/交易部SOP/交易部/權證相關/標的證券/111年度權證標的/標的證券(111Q1_1101230公告)/1101230底稿.xlsx'#上櫃公司基本資料.$A:.$C];3;FALSE);\"找不到\")","v":"SOFT-WORLD　　"},5483,{"$f":"of:=IFERROR(VLOOKUP([.E33];['file:///D:/公司/公司用/交易部SOP/交易部/權證相關/標的證券/111年度權證標的/標的證券(111Q1_1101230公告)/1101230底稿.xlsx'#上櫃公司基本資料.$A:.$C];3;FALSE);\"找不到\")","v":"SAS　　"}]
[5536,{"$f":"of:=IFERROR(VLOOKUP([.A34];['file:///D:/公司/公司用/交易部SOP/交易部/權證相關/標的證券/111年度權證標的/標的證券(111Q1_1101230公告)/1101230底稿.xlsx'#上櫃公司基本資料.$A:.$C];3;FALSE);\"找不到\")","v":"ACTER"},5609,{"$f":"of:=IFERROR(VLOOKUP([.C34];['file:///D:/公司/公司用/交易部SOP/交易部/權證相關/標的證券/111年度權證標的/標的證券(111Q1_1101230公告)/1101230底稿.xlsx'#上櫃公司基本資料.$A:.$C];3;FALSE);\"找不到\")","v":"DIMERCO"},6015,{"$f":"of:=IFERROR(VLOOKUP([.E34];['file:///D:/公司/公司用/交易部SOP/交易部/權證相關/標的證券/111年度權證標的/標的證券(111Q1_1101230公告)/1101230底稿.xlsx'#上櫃公司基本資料.$A:.$C];3;FALSE);\"找不到\")","v":"HORIZON Sec."}]
[6016,{"$f":"of:=IFERROR(VLOOKUP([.A35];['file:///D:/公司/公司用/交易部SOP/交易部/權證相關/標的證券/111年度權證標的/標的證券(111Q1_1101230公告)/1101230底稿.xlsx'#上櫃公司基本資料.$A:.$C];3;FALSE);\"找不到\")","v":"concords　　"},6026,{"$f":"of:=IFERROR(VLOOKUP([.C35];['file:///D:/公司/公司用/交易部SOP/交易部/權證相關/標的證券/111年度權證標的/標的證券(111Q1_1101230公告)/1101230底稿.xlsx'#上櫃公司基本資料.$A:.$C];3;FALSE);\"找不到\")","v":"GFS"},6104,{"$f":"of:=IFERROR(VLOOKUP([.E35];['file:///D:/公司/公司用/交易部SOP/交易部/權證相關/標的證券/111年度權證標的/標的證券(111Q1_1101230公告)/1101230底稿.xlsx'#上櫃公司基本資料.$A:.$C];3;FALSE);\"找不到\")","v":"GLI"}]
[6111,{"$f":"of:=IFERROR(VLOOKUP([.A36];['file:///D:/公司/公司用/交易部SOP/交易部/權證相關/標的證券/111年度權證標的/標的證券(111Q1_1101230公告)/1101230底稿.xlsx'#上櫃公司基本資料.$A:.$C];3;FALSE);\"找不到\")","v":"SOFTSTAR"},6118,{"$f":"of:=IFERROR(VLOOKUP([.C36];['file:///D:/公司/公司用/交易部SOP/交易部/權證相關/標的證券/111年度權證標的/標的證券(111Q1_1101230公告)/1101230底稿.xlsx'#上櫃公司基本資料.$A:.$C];3;FALSE);\"找不到\")","v":"Xander　　"},6121,{"$f":"of:=IFERROR(VLOOKUP([.E36];['file:///D:/公司/公司用/交易部SOP/交易部/權證相關/標的證券/111年度權證標的/標的證券(111Q1_1101230公告)/1101230底稿.xlsx'#上櫃公司基本資料.$A:.$C];3;FALSE);\"找不到\")","v":"SMP　"}]
[6125,{"$f":"of:=IFERROR(VLOOKUP([.A37];['file:///D:/公司/公司用/交易部SOP/交易部/權證相關/標的證券/111年度權證標的/標的證券(111Q1_1101230公告)/1101230底稿.xlsx'#上櫃公司基本資料.$A:.$C];3;FALSE);\"找不到\")","v":"KENMEC　"},6129,{"$f":"of:=IFERROR(VLOOKUP([.C37];['file:///D:/公司/公司用/交易部SOP/交易部/權證相關/標的證券/111年度權證標的/標的證券(111Q1_1101230公告)/1101230底稿.xlsx'#上櫃公司基本資料.$A:.$C];3;FALSE);\"找不到\")","v":"PTC　　"},6138,{"$f":"of:=IFERROR(VLOOKUP([.E37];['file:///D:/公司/公司用/交易部SOP/交易部/權證相關/標的證券/111年度權證標的/標的證券(111Q1_1101230公告)/1101230底稿.xlsx'#上櫃公司基本資料.$A:.$C];3;FALSE);\"找不到\")","v":"ANPEC"}]
[6143,{"$f":"of:=IFERROR(VLOOKUP([.A38];['file:///D:/公司/公司用/交易部SOP/交易部/權證相關/標的證券/111年度權證標的/標的證券(111Q1_1101230公告)/1101230底稿.xlsx'#上櫃公司基本資料.$A:.$C];3;FALSE);\"找不到\")","v":"NETRONIX,INC."},6147,{"$f":"of:=IFERROR(VLOOKUP([.C38];['file:///D:/公司/公司用/交易部SOP/交易部/權證相關/標的證券/111年度權證標的/標的證券(111Q1_1101230公告)/1101230底稿.xlsx'#上櫃公司基本資料.$A:.$C];3;FALSE);\"找不到\")","v":"CHIPBOND　"},6150,{"$f":"of:=IFERROR(VLOOKUP([.E38];['file:///D:/公司/公司用/交易部SOP/交易部/權證相關/標的證券/111年度權證標的/標的證券(111Q1_1101230公告)/1101230底稿.xlsx'#上櫃公司基本資料.$A:.$C];3;FALSE);\"找不到\")","v":"Tul"}]
[6173,{"$f":"of:=IFERROR(VLOOKUP([.A39];['file:///D:/公司/公司用/交易部SOP/交易部/權證相關/標的證券/111年度權證標的/標的證券(111Q1_1101230公告)/1101230底稿.xlsx'#上櫃公司基本資料.$A:.$C];3;FALSE);\"找不到\")","v":"P.D.C.　"},6175,{"$f":"of:=IFERROR(VLOOKUP([.C39];['file:///D:/公司/公司用/交易部SOP/交易部/權證相關/標的證券/111年度權證標的/標的證券(111Q1_1101230公告)/1101230底稿.xlsx'#上櫃公司基本資料.$A:.$C];3;FALSE);\"找不到\")","v":"LITON"},6180,{"$f":"of:=IFERROR(VLOOKUP([.E39];['file:///D:/公司/公司用/交易部SOP/交易部/權證相關/標的證券/111年度權證標的/標的證券(111Q1_1101230公告)/1101230底稿.xlsx'#上櫃公司基本資料.$A:.$C];3;FALSE);\"找不到\")","v":"GAMANIA"}]
[6182,{"$f":"of:=IFERROR(VLOOKUP([.A40];['file:///D:/公司/公司用/交易部SOP/交易部/權證相關/標的證券/111年度權證標的/標的證券(111Q1_1101230公告)/1101230底稿.xlsx'#上櫃公司基本資料.$A:.$C];3;FALSE);\"找不到\")","v":"WAFER WORKS"},6187,{"$f":"of:=IFERROR(VLOOKUP([.C40];['file:///D:/公司/公司用/交易部SOP/交易部/權證相關/標的證券/111年度權證標的/標的證券(111Q1_1101230公告)/1101230底稿.xlsx'#上櫃公司基本資料.$A:.$C];3;FALSE);\"找不到\")","v":"ALL RING"},6188,{"$f":"of:=IFERROR(VLOOKUP([.E40];['file:///D:/公司/公司用/交易部SOP/交易部/權證相關/標的證券/111年度權證標的/標的證券(111Q1_1101230公告)/1101230底稿.xlsx'#上櫃公司基本資料.$A:.$C];3;FALSE);\"找不到\")","v":"QSI　"}]
[6190,{"$f":"of:=IFERROR(VLOOKUP([.A41];['file:///D:/公司/公司用/交易部SOP/交易部/權證相關/標的證券/111年度權證標的/標的證券(111Q1_1101230公告)/1101230底稿.xlsx'#上櫃公司基本資料.$A:.$C];3;FALSE);\"找不到\")","v":"WONDERFUL　　"},6203,{"$f":"of:=IFERROR(VLOOKUP([.C41];['file:///D:/公司/公司用/交易部SOP/交易部/權證相關/標的證券/111年度權證標的/標的證券(111Q1_1101230公告)/1101230底稿.xlsx'#上櫃公司基本資料.$A:.$C];3;FALSE);\"找不到\")","v":"Sea Sonic"},6208,{"$f":"of:=IFERROR(VLOOKUP([.E41];['file:///D:/公司/公司用/交易部SOP/交易部/權證相關/標的證券/111年度權證標的/標的證券(111Q1_1101230公告)/1101230底稿.xlsx'#上櫃公司基本資料.$A:.$C];3;FALSE);\"找不到\")","v":"Htc"}]
[6223,{"$f":"of:=IFERROR(VLOOKUP([.A42];['file:///D:/公司/公司用/交易部SOP/交易部/權證相關/標的證券/111年度權證標的/標的證券(111Q1_1101230公告)/1101230底稿.xlsx'#上櫃公司基本資料.$A:.$C];3;FALSE);\"找不到\")","v":"MPI"},6237,{"$f":"of:=IFERROR(VLOOKUP([.C42];['file:///D:/公司/公司用/交易部SOP/交易部/權證相關/標的證券/111年度權證標的/標的證券(111Q1_1101230公告)/1101230底稿.xlsx'#上櫃公司基本資料.$A:.$C];3;FALSE);\"找不到\")","v":"CMEI"},6244,{"$f":"of:=IFERROR(VLOOKUP([.E42];['file:///D:/公司/公司用/交易部SOP/交易部/權證相關/標的證券/111年度權證標的/標的證券(111Q1_1101230公告)/1101230底稿.xlsx'#上櫃公司基本資料.$A:.$C];3;FALSE);\"找不到\")","v":"MOTECH"}]
[6245,{"$f":"of:=IFERROR(VLOOKUP([.A43];['file:///D:/公司/公司用/交易部SOP/交易部/權證相關/標的證券/111年度權證標的/標的證券(111Q1_1101230公告)/1101230底稿.xlsx'#上櫃公司基本資料.$A:.$C];3;FALSE);\"找不到\")","v":"Lanner　"},6261,{"$f":"of:=IFERROR(VLOOKUP([.C43];['file:///D:/公司/公司用/交易部SOP/交易部/權證相關/標的證券/111年度權證標的/標的證券(111Q1_1101230公告)/1101230底稿.xlsx'#上櫃公司基本資料.$A:.$C];3;FALSE);\"找不到\")","v":"YTEC"},6274,{"$f":"of:=IFERROR(VLOOKUP([.E43];['file:///D:/公司/公司用/交易部SOP/交易部/權證相關/標的證券/111年度權證標的/標的證券(111Q1_1101230公告)/1101230底稿.xlsx'#上櫃公司基本資料.$A:.$C];3;FALSE);\"找不到\")","v":"tuc"}]
[6279,{"$f":"of:=IFERROR(VLOOKUP([.A44];['file:///D:/公司/公司用/交易部SOP/交易部/權證相關/標的證券/111年度權證標的/標的證券(111Q1_1101230公告)/1101230底稿.xlsx'#上櫃公司基本資料.$A:.$C];3;FALSE);\"找不到\")","v":"HU LANE　"},6284,{"$f":"of:=IFERROR(VLOOKUP([.C44];['file:///D:/公司/公司用/交易部SOP/交易部/權證相關/標的證券/111年度權證標的/標的證券(111Q1_1101230公告)/1101230底稿.xlsx'#上櫃公司基本資料.$A:.$C];3;FALSE);\"找不到\")","v":"INPAQ　　"},6290,{"$f":"of:=IFERROR(VLOOKUP([.E44];['file:///D:/公司/公司用/交易部SOP/交易部/權證相關/標的證券/111年度權證標的/標的證券(111Q1_1101230公告)/1101230底稿.xlsx'#上櫃公司基本資料.$A:.$C];3;FALSE);\"找不到\")","v":"LONGWELL　　"}]
[6411,{"$f":"of:=IFERROR(VLOOKUP([.A45];['file:///D:/公司/公司用/交易部SOP/交易部/權證相關/標的證券/111年度權證標的/標的證券(111Q1_1101230公告)/1101230底稿.xlsx'#上櫃公司基本資料.$A:.$C];3;FALSE);\"找不到\")","v":"Amazing"},6435,{"$f":"of:=IFERROR(VLOOKUP([.C45];['file:///D:/公司/公司用/交易部SOP/交易部/權證相關/標的證券/111年度權證標的/標的證券(111Q1_1101230公告)/1101230底稿.xlsx'#上櫃公司基本資料.$A:.$C];3;FALSE);\"找不到\")","v":"Sinopower"},6457,{"$f":"of:=IFERROR(VLOOKUP([.E45];['file:///D:/公司/公司用/交易部SOP/交易部/權證相關/標的證券/111年度權證標的/標的證券(111Q1_1101230公告)/1101230底稿.xlsx'#上櫃公司基本資料.$A:.$C];3;FALSE);\"找不到\")","v":"HYCON"}]
[6462,{"$f":"of:=IFERROR(VLOOKUP([.A46];['file:///D:/公司/公司用/交易部SOP/交易部/權證相關/標的證券/111年度權證標的/標的證券(111Q1_1101230公告)/1101230底稿.xlsx'#上櫃公司基本資料.$A:.$C];3;FALSE);\"找不到\")","v":"EGIS"},6469,{"$f":"of:=IFERROR(VLOOKUP([.C46];['file:///D:/公司/公司用/交易部SOP/交易部/權證相關/標的證券/111年度權證標的/標的證券(111Q1_1101230公告)/1101230底稿.xlsx'#上櫃公司基本資料.$A:.$C];3;FALSE);\"找不到\")","v":"Great Tree"},6472,{"$f":"of:=IFERROR(VLOOKUP([.E46];['file:///D:/公司/公司用/交易部SOP/交易部/權證相關/標的證券/111年度權證標的/標的證券(111Q1_1101230公告)/1101230底稿.xlsx'#上櫃公司基本資料.$A:.$C];3;FALSE);\"找不到\")","v":"Bora"}]
[6485,{"$f":"of:=IFERROR(VLOOKUP([.A47];['file:///D:/公司/公司用/交易部SOP/交易部/權證相關/標的證券/111年度權證標的/標的證券(111Q1_1101230公告)/1101230底稿.xlsx'#上櫃公司基本資料.$A:.$C];3;FALSE);\"找不到\")","v":"ASolid"},6488,{"$f":"of:=IFERROR(VLOOKUP([.C47];['file:///D:/公司/公司用/交易部SOP/交易部/權證相關/標的證券/111年度權證標的/標的證券(111Q1_1101230公告)/1101230底稿.xlsx'#上櫃公司基本資料.$A:.$C];3;FALSE);\"找不到\")","v":"GWC"},6494,{"$f":"of:=IFERROR(VLOOKUP([.E47];['file:///D:/公司/公司用/交易部SOP/交易部/權證相關/標的證券/111年度權證標的/標的證券(111Q1_1101230公告)/1101230底稿.xlsx'#上櫃公司基本資料.$A:.$C];3;FALSE);\"找不到\")","v":"Nyquest"}]
[6499,{"$f":"of:=IFERROR(VLOOKUP([.A48];['file:///D:/公司/公司用/交易部SOP/交易部/權證相關/標的證券/111年度權證標的/標的證券(111Q1_1101230公告)/1101230底稿.xlsx'#上櫃公司基本資料.$A:.$C];3;FALSE);\"找不到\")","v":"Medeon"},6509,{"$f":"of:=IFERROR(VLOOKUP([.C48];['file:///D:/公司/公司用/交易部SOP/交易部/權證相關/標的證券/111年度權證標的/標的證券(111Q1_1101230公告)/1101230底稿.xlsx'#上櫃公司基本資料.$A:.$C];3;FALSE);\"找不到\")","v":"HOPAX　"},6510,{"$f":"of:=IFERROR(VLOOKUP([.E48];['file:///D:/公司/公司用/交易部SOP/交易部/權證相關/標的證券/111年度權證標的/標的證券(111Q1_1101230公告)/1101230底稿.xlsx'#上櫃公司基本資料.$A:.$C];3;FALSE);\"找不到\")","v":"CHPT"}]
[6516,{"$f":"of:=IFERROR(VLOOKUP([.A49];['file:///D:/公司/公司用/交易部SOP/交易部/權證相關/標的證券/111年度權證標的/標的證券(111Q1_1101230公告)/1101230底稿.xlsx'#上櫃公司基本資料.$A:.$C];3;FALSE);\"找不到\")","v":"KINGWAY"},6523,{"$f":"of:=IFERROR(VLOOKUP([.C49];['file:///D:/公司/公司用/交易部SOP/交易部/權證相關/標的證券/111年度權證標的/標的證券(111Q1_1101230公告)/1101230底稿.xlsx'#上櫃公司基本資料.$A:.$C];3;FALSE);\"找不到\")","v":"DR.WU"},6535,{"$f":"of:=IFERROR(VLOOKUP([.E49];['file:///D:/公司/公司用/交易部SOP/交易部/權證相關/標的證券/111年度權證標的/標的證券(111Q1_1101230公告)/1101230底稿.xlsx'#上櫃公司基本資料.$A:.$C];3;FALSE);\"找不到\")","v":"LUMOSA"}]
[6547,{"$f":"of:=IFERROR(VLOOKUP([.A50];['file:///D:/公司/公司用/交易部SOP/交易部/權證相關/標的證券/111年度權證標的/標的證券(111Q1_1101230公告)/1101230底稿.xlsx'#上櫃公司基本資料.$A:.$C];3;FALSE);\"找不到\")","v":"MVC"},6548,{"$f":"of:=IFERROR(VLOOKUP([.C50];['file:///D:/公司/公司用/交易部SOP/交易部/權證相關/標的證券/111年度權證標的/標的證券(111Q1_1101230公告)/1101230底稿.xlsx'#上櫃公司基本資料.$A:.$C];3;FALSE);\"找不到\")","v":"CWTC"},6568,{"$f":"of:=IFERROR(VLOOKUP([.E50];['file:///D:/公司/公司用/交易部SOP/交易部/權證相關/標的證券/111年度權證標的/標的證券(111Q1_1101230公告)/1101230底稿.xlsx'#上櫃公司基本資料.$A:.$C];3;FALSE);\"找不到\")","v":"Rafael Micro"}]
[6643,{"$f":"of:=IFERROR(VLOOKUP([.A51];['file:///D:/公司/公司用/交易部SOP/交易部/權證相關/標的證券/111年度權證標的/標的證券(111Q1_1101230公告)/1101230底稿.xlsx'#上櫃公司基本資料.$A:.$C];3;FALSE);\"找不到\")","v":"M31"},6664,{"$f":"of:=IFERROR(VLOOKUP([.C51];['file:///D:/公司/公司用/交易部SOP/交易部/權證相關/標的證券/111年度權證標的/標的證券(111Q1_1101230公告)/1101230底稿.xlsx'#上櫃公司基本資料.$A:.$C];3;FALSE);\"找不到\")","v":"Group Up"},6679,{"$f":"of:=IFERROR(VLOOKUP([.E51];['file:///D:/公司/公司用/交易部SOP/交易部/權證相關/標的證券/111年度權證標的/標的證券(111Q1_1101230公告)/1101230底稿.xlsx'#上櫃公司基本資料.$A:.$C];3;FALSE);\"找不到\")","v":"ZILLTEK"}]
[6683,{"$f":"of:=IFERROR(VLOOKUP([.A52];['file:///D:/公司/公司用/交易部SOP/交易部/權證相關/標的證券/111年度權證標的/標的證券(111Q1_1101230公告)/1101230底稿.xlsx'#上櫃公司基本資料.$A:.$C];3;FALSE);\"找不到\")","v":"KSMT"},6684,{"$f":"of:=IFERROR(VLOOKUP([.C52];['file:///D:/公司/公司用/交易部SOP/交易部/權證相關/標的證券/111年度權證標的/標的證券(111Q1_1101230公告)/1101230底稿.xlsx'#上櫃公司基本資料.$A:.$C];3;FALSE);\"找不到\")","v":"AlgolTek"},6712,{"$f":"of:=IFERROR(VLOOKUP([.E52];['file:///D:/公司/公司用/交易部SOP/交易部/權證相關/標的證券/111年度權證標的/標的證券(111Q1_1101230公告)/1101230底稿.xlsx'#上櫃公司基本資料.$A:.$C];3;FALSE);\"找不到\")","v":"Ever Supreme"}]
[6732,{"$f":"of:=IFERROR(VLOOKUP([.A53];['file:///D:/公司/公司用/交易部SOP/交易部/權證相關/標的證券/111年度權證標的/標的證券(111Q1_1101230公告)/1101230底稿.xlsx'#上櫃公司基本資料.$A:.$C];3;FALSE);\"找不到\")","v":"sensortek"},6741,{"$f":"of:=IFERROR(VLOOKUP([.C53];['file:///D:/公司/公司用/交易部SOP/交易部/權證相關/標的證券/111年度權證標的/標的證券(111Q1_1101230公告)/1101230底稿.xlsx'#上櫃公司基本資料.$A:.$C];3;FALSE);\"找不到\")","v":"91APP"},6747,{"$f":"of:=IFERROR(VLOOKUP([.E53];['file:///D:/公司/公司用/交易部SOP/交易部/權證相關/標的證券/111年度權證標的/標的證券(111Q1_1101230公告)/1101230底稿.xlsx'#上櫃公司基本資料.$A:.$C];3;FALSE);\"找不到\")","v":"BTOX"}]
[6788,{"$f":"of:=IFERROR(VLOOKUP([.A54];['file:///D:/公司/公司用/交易部SOP/交易部/權證相關/標的證券/111年度權證標的/標的證券(111Q1_1101230公告)/1101230底稿.xlsx'#上櫃公司基本資料.$A:.$C];3;FALSE);\"找不到\")","v":"Brillian"},8027,{"$f":"of:=IFERROR(VLOOKUP([.C54];['file:///D:/公司/公司用/交易部SOP/交易部/權證相關/標的證券/111年度權證標的/標的證券(111Q1_1101230公告)/1101230底稿.xlsx'#上櫃公司基本資料.$A:.$C];3;FALSE);\"找不到\")","v":"E&R"},8040,{"$f":"of:=IFERROR(VLOOKUP([.E54];['file:///D:/公司/公司用/交易部SOP/交易部/權證相關/標的證券/111年度權證標的/標的證券(111Q1_1101230公告)/1101230底稿.xlsx'#上櫃公司基本資料.$A:.$C];3;FALSE);\"找不到\")","v":"IC+　"}]
[8044,{"$f":"of:=IFERROR(VLOOKUP([.A55];['file:///D:/公司/公司用/交易部SOP/交易部/權證相關/標的證券/111年度權證標的/標的證券(111Q1_1101230公告)/1101230底稿.xlsx'#上櫃公司基本資料.$A:.$C];3;FALSE);\"找不到\")","v":"PChome online"},8054,{"$f":"of:=IFERROR(VLOOKUP([.C55];['file:///D:/公司/公司用/交易部SOP/交易部/權證相關/標的證券/111年度權證標的/標的證券(111Q1_1101230公告)/1101230底稿.xlsx'#上櫃公司基本資料.$A:.$C];3;FALSE);\"找不到\")","v":"Alcor Micro"},8069,{"$f":"of:=IFERROR(VLOOKUP([.E55];['file:///D:/公司/公司用/交易部SOP/交易部/權證相關/標的證券/111年度權證標的/標的證券(111Q1_1101230公告)/1101230底稿.xlsx'#上櫃公司基本資料.$A:.$C];3;FALSE);\"找不到\")","v":"EIH"}]
[8076,{"$f":"of:=IFERROR(VLOOKUP([.A56];['file:///D:/公司/公司用/交易部SOP/交易部/權證相關/標的證券/111年度權證標的/標的證券(111Q1_1101230公告)/1101230底稿.xlsx'#上櫃公司基本資料.$A:.$C];3;FALSE);\"找不到\")","v":"FIRICH　　"},8086,{"$f":"of:=IFERROR(VLOOKUP([.C56];['file:///D:/公司/公司用/交易部SOP/交易部/權證相關/標的證券/111年度權證標的/標的證券(111Q1_1101230公告)/1101230底稿.xlsx'#上櫃公司基本資料.$A:.$C];3;FALSE);\"找不到\")","v":"AWSC　　"},8121,{"$f":"of:=IFERROR(VLOOKUP([.E56];['file:///D:/公司/公司用/交易部SOP/交易部/權證相關/標的證券/111年度權證標的/標的證券(111Q1_1101230公告)/1101230底稿.xlsx'#上櫃公司基本資料.$A:.$C];3;FALSE);\"找不到\")","v":"ACME"}]
[8155,{"$f":"of:=IFERROR(VLOOKUP([.A57];['file:///D:/公司/公司用/交易部SOP/交易部/權證相關/標的證券/111年度權證標的/標的證券(111Q1_1101230公告)/1101230底稿.xlsx'#上櫃公司基本資料.$A:.$C];3;FALSE);\"找不到\")","v":"ACCL　"},8182,{"$f":"of:=IFERROR(VLOOKUP([.C57];['file:///D:/公司/公司用/交易部SOP/交易部/權證相關/標的證券/111年度權證標的/標的證券(111Q1_1101230公告)/1101230底稿.xlsx'#上櫃公司基本資料.$A:.$C];3;FALSE);\"找不到\")","v":"HELE　"},8183,{"$f":"of:=IFERROR(VLOOKUP([.E57];['file:///D:/公司/公司用/交易部SOP/交易部/權證相關/標的證券/111年度權證標的/標的證券(111Q1_1101230公告)/1101230底稿.xlsx'#上櫃公司基本資料.$A:.$C];3;FALSE);\"找不到\")","v":"ITC"}]
[8255,{"$f":"of:=IFERROR(VLOOKUP([.A58];['file:///D:/公司/公司用/交易部SOP/交易部/權證相關/標的證券/111年度權證標的/標的證券(111Q1_1101230公告)/1101230底稿.xlsx'#上櫃公司基本資料.$A:.$C];3;FALSE);\"找不到\")","v":"ATC　"},8299,{"$f":"of:=IFERROR(VLOOKUP([.C58];['file:///D:/公司/公司用/交易部SOP/交易部/權證相關/標的證券/111年度權證標的/標的證券(111Q1_1101230公告)/1101230底稿.xlsx'#上櫃公司基本資料.$A:.$C];3;FALSE);\"找不到\")","v":"Phison"},8358,{"$f":"of:=IFERROR(VLOOKUP([.E58];['file:///D:/公司/公司用/交易部SOP/交易部/權證相關/標的證券/111年度權證標的/標的證券(111Q1_1101230公告)/1101230底稿.xlsx'#上櫃公司基本資料.$A:.$C];3;FALSE);\"找不到\")","v":"CO-TECH"}]
[8383,{"$f":"of:=IFERROR(VLOOKUP([.A59];['file:///D:/公司/公司用/交易部SOP/交易部/權證相關/標的證券/111年度權證標的/標的證券(111Q1_1101230公告)/1101230底稿.xlsx'#上櫃公司基本資料.$A:.$C];3;FALSE);\"找不到\")","v":"ChenFull"},8390,{"$f":"of:=IFERROR(VLOOKUP([.C59];['file:///D:/公司/公司用/交易部SOP/交易部/權證相關/標的證券/111年度權證標的/標的證券(111Q1_1101230公告)/1101230底稿.xlsx'#上櫃公司基本資料.$A:.$C];3;FALSE);\"找不到\")","v":"JYD"},8406,{"$f":"of:=IFERROR(VLOOKUP([.E59];['file:///D:/公司/公司用/交易部SOP/交易部/權證相關/標的證券/111年度權證標的/標的證券(111Q1_1101230公告)/1101230底稿.xlsx'#上櫃公司基本資料.$A:.$C];3;FALSE);\"找不到\")","v":"GINKO"}]
[8415,{"$f":"of:=IFERROR(VLOOKUP([.A60];['file:///D:/公司/公司用/交易部SOP/交易部/權證相關/標的證券/111年度權證標的/標的證券(111Q1_1101230公告)/1101230底稿.xlsx'#上櫃公司基本資料.$A:.$C];3;FALSE);\"找不到\")","v":"Brighton-Best"},8436,{"$f":"of:=IFERROR(VLOOKUP([.C60];['file:///D:/公司/公司用/交易部SOP/交易部/權證相關/標的證券/111年度權證標的/標的證券(111Q1_1101230公告)/1101230底稿.xlsx'#上櫃公司基本資料.$A:.$C];3;FALSE);\"找不到\")","v":"TCI"},8924,{"$f":"of:=IFERROR(VLOOKUP([.E60];['file:///D:/公司/公司用/交易部SOP/交易部/權證相關/標的證券/111年度權證標的/標的證券(111Q1_1101230公告)/1101230底稿.xlsx'#上櫃公司基本資料.$A:.$C];3;FALSE);\"找不到\")","v":"O-TA"}]
[8927,{"$f":"of:=IFERROR(VLOOKUP([.A61];['file:///D:/公司/公司用/交易部SOP/交易部/權證相關/標的證券/111年度權證標的/標的證券(111Q1_1101230公告)/1101230底稿.xlsx'#上櫃公司基本資料.$A:.$C];3;FALSE);\"找不到\")","v":"Pei Chi　"},8936,{"$f":"of:=IFERROR(VLOOKUP([.C61];['file:///D:/公司/公司用/交易部SOP/交易部/權證相關/標的證券/111年度權證標的/標的證券(111Q1_1101230公告)/1101230底稿.xlsx'#上櫃公司基本資料.$A:.$C];3;FALSE);\"找不到\")","v":"KTI"},8938,{"$f":"of:=IFERROR(VLOOKUP([.E61];['file:///D:/公司/公司用/交易部SOP/交易部/權證相關/標的證券/111年度權證標的/標的證券(111Q1_1101230公告)/1101230底稿.xlsx'#上櫃公司基本資料.$A:.$C];3;FALSE);\"找不到\")","v":"ADVANCED  GROUP"}]
[8942,{"$f":"of:=IFERROR(VLOOKUP([.A62];['file:///D:/公司/公司用/交易部SOP/交易部/權證相關/標的證券/111年度權證標的/標的證券(111Q1_1101230公告)/1101230底稿.xlsx'#上櫃公司基本資料.$A:.$C];3;FALSE);\"找不到\")","v":"Xxentria　"}]
[]
[]
[{"$f":"of:=CONCATENATE(\"Chart-2：\";COUNT([.A67:.F82]);\" TPEx-listed securities for A-level issuers\")","v":"Chart-2：47 TPEx-listed securities for A-level issuers"}]
["Code","Company Name","Code","Company Name","Code","Company Name"]
[1569,{"$f":"of:=IFERROR(VLOOKUP([.A67];['file:///D:/公司/公司用/交易部SOP/交易部/權證相關/標的證券/111年度權證標的/標的證券(111Q1_1101230公告)/1101230底稿.xlsx'#上櫃公司基本資料.$A:.$C];3;FALSE);\"找不到\")","v":"Bin Chuan"},1586,{"$f":"of:=IFERROR(VLOOKUP([.C67];['file:///D:/公司/公司用/交易部SOP/交易部/權證相關/標的證券/111年度權證標的/標的證券(111Q1_1101230公告)/1101230底稿.xlsx'#上櫃公司基本資料.$A:.$C];3;FALSE);\"找不到\")","v":"CFTC"},1599,{"$f":"of:=IFERROR(VLOOKUP([.E67];['file:///D:/公司/公司用/交易部SOP/交易部/權證相關/標的證券/111年度權證標的/標的證券(111Q1_1101230公告)/1101230底稿.xlsx'#上櫃公司基本資料.$A:.$C];3;FALSE);\"找不到\")","v":"AEON"}]
[2754,{"$f":"of:=IFERROR(VLOOKUP([.A68];['file:///D:/公司/公司用/交易部SOP/交易部/權證相關/標的證券/111年度權證標的/標的證券(111Q1_1101230公告)/1101230底稿.xlsx'#上櫃公司基本資料.$A:.$C];3;FALSE);\"找不到\")","v":"KURA SUSHI ASIA"},3071,{"$f":"of:=IFERROR(VLOOKUP([.C68];['file:///D:/公司/公司用/交易部SOP/交易部/權證相關/標的證券/111年度權證標的/標的證券(111Q1_1101230公告)/1101230底稿.xlsx'#上櫃公司基本資料.$A:.$C];3;FALSE);\"找不到\")","v":"ADDA　"},3163,{"$f":"of:=IFERROR(VLOOKUP([.E68];['file:///D:/公司/公司用/交易部SOP/交易部/權證相關/標的證券/111年度權證標的/標的證券(111Q1_1101230公告)/1101230底稿.xlsx'#上櫃公司基本資料.$A:.$C];3;FALSE);\"找不到\")","v":"Browave　　"}]
[3178,{"$f":"of:=IFERROR(VLOOKUP([.A69];['file:///D:/公司/公司用/交易部SOP/交易部/權證相關/標的證券/111年度權證標的/標的證券(111Q1_1101230公告)/1101230底稿.xlsx'#上櫃公司基本資料.$A:.$C];3;FALSE);\"找不到\")","v":"GONGIN"},3213,{"$f":"of:=IFERROR(VLOOKUP([.C69];['file:///D:/公司/公司用/交易部SOP/交易部/權證相關/標的證券/111年度權證標的/標的證券(111Q1_1101230公告)/1101230底稿.xlsx'#上櫃公司基本資料.$A:.$C];3;FALSE);\"找不到\")","v":"Mildef"},3323,{"$f":"of:=IFERROR(VLOOKUP([.E69];['file:///D:/公司/公司用/交易部SOP/交易部/權證相關/標的證券/111年度權證標的/標的證券(111Q1_1101230公告)/1101230底稿.xlsx'#上櫃公司基本資料.$A:.$C];3;FALSE);\"找不到\")","v":"Celxpert"}]
[3402,{"$f":"of:=IFERROR(VLOOKUP([.A70];['file:///D:/公司/公司用/交易部SOP/交易部/權證相關/標的證券/111年度權證標的/標的證券(111Q1_1101230公告)/1101230底稿.xlsx'#上櫃公司基本資料.$A:.$C];3;FALSE);\"找不到\")","v":"WHOLETECH"},3511,{"$f":"of:=IFERROR(VLOOKUP([.C70];['file:///D:/公司/公司用/交易部SOP/交易部/權證相關/標的證券/111年度權證標的/標的證券(111Q1_1101230公告)/1101230底稿.xlsx'#上櫃公司基本資料.$A:.$C];3;FALSE);\"找不到\")","v":"SIMULA TECH INC"},3540,{"$f":"of:=IFERROR(VLOOKUP([.E70];['file:///D:/公司/公司用/交易部SOP/交易部/權證相關/標的證券/111年度權證標的/標的證券(111Q1_1101230公告)/1101230底稿.xlsx'#上櫃公司基本資料.$A:.$C];3;FALSE);\"找不到\")","v":"Thermaltake"}]
[3541,{"$f":"of:=IFERROR(VLOOKUP([.A71];['file:///D:/公司/公司用/交易部SOP/交易部/權證相關/標的證券/111年度權證標的/標的證券(111Q1_1101230公告)/1101230底稿.xlsx'#上櫃公司基本資料.$A:.$C];3;FALSE);\"找不到\")","v":"CYP"},3548,{"$f":"of:=IFERROR(VLOOKUP([.C71];['file:///D:/公司/公司用/交易部SOP/交易部/權證相關/標的證券/111年度權證標的/標的證券(111Q1_1101230公告)/1101230底稿.xlsx'#上櫃公司基本資料.$A:.$C];3;FALSE);\"找不到\")","v":"JARLLY"},3577,{"$f":"of:=IFERROR(VLOOKUP([.E71];['file:///D:/公司/公司用/交易部SOP/交易部/權證相關/標的證券/111年度權證標的/標的證券(111Q1_1101230公告)/1101230底稿.xlsx'#上櫃公司基本資料.$A:.$C];3;FALSE);\"找不到\")","v":"ICP DAS"}]
[3689,{"$f":"of:=IFERROR(VLOOKUP([.A72];['file:///D:/公司/公司用/交易部SOP/交易部/權證相關/標的證券/111年度權證標的/標的證券(111Q1_1101230公告)/1101230底稿.xlsx'#上櫃公司基本資料.$A:.$C];3;FALSE);\"找不到\")","v":"UDE"},3709,{"$f":"of:=IFERROR(VLOOKUP([.C72];['file:///D:/公司/公司用/交易部SOP/交易部/權證相關/標的證券/111年度權證標的/標的證券(111Q1_1101230公告)/1101230底稿.xlsx'#上櫃公司基本資料.$A:.$C];3;FALSE);\"找不到\")","v":"Trigold"},4171,{"$f":"of:=IFERROR(VLOOKUP([.E72];['file:///D:/公司/公司用/交易部SOP/交易部/權證相關/標的證券/111年度權證標的/標的證券(111Q1_1101230公告)/1101230底稿.xlsx'#上櫃公司基本資料.$A:.$C];3;FALSE);\"找不到\")","v":"GeneReach"}]
[4760,{"$f":"of:=IFERROR(VLOOKUP([.A73];['file:///D:/公司/公司用/交易部SOP/交易部/權證相關/標的證券/111年度權證標的/標的證券(111Q1_1101230公告)/1101230底稿.xlsx'#上櫃公司基本資料.$A:.$C];3;FALSE);\"找不到\")","v":"ample"},4933,{"$f":"of:=IFERROR(VLOOKUP([.C73];['file:///D:/公司/公司用/交易部SOP/交易部/權證相關/標的證券/111年度權證標的/標的證券(111Q1_1101230公告)/1101230底稿.xlsx'#上櫃公司基本資料.$A:.$C];3;FALSE);\"找不到\")","v":"UBRIGHT"},5014,{"$f":"of:=IFERROR(VLOOKUP([.E73];['file:///D:/公司/公司用/交易部SOP/交易部/權證相關/標的證券/111年度權證標的/標的證券(111Q1_1101230公告)/1101230底稿.xlsx'#上櫃公司基本資料.$A:.$C];3;FALSE);\"找不到\")","v":"CCI　　"}]
[5245,{"$f":"of:=IFERROR(VLOOKUP([.A74];['file:///D:/公司/公司用/交易部SOP/交易部/權證相關/標的證券/111年度權證標的/標的證券(111Q1_1101230公告)/1101230底稿.xlsx'#上櫃公司基本資料.$A:.$C];3;FALSE);\"找不到\")","v":"WSI"},5312,{"$f":"of:=IFERROR(VLOOKUP([.C74];['file:///D:/公司/公司用/交易部SOP/交易部/權證相關/標的證券/111年度權證標的/標的證券(111Q1_1101230公告)/1101230底稿.xlsx'#上櫃公司基本資料.$A:.$C];3;FALSE);\"找不到\")","v":"FORMOSA"},5321,{"$f":"of:=IFERROR(VLOOKUP([.E74];['file:///D:/公司/公司用/交易部SOP/交易部/權證相關/標的證券/111年度權證標的/標的證券(111Q1_1101230公告)/1101230底稿.xlsx'#上櫃公司基本資料.$A:.$C];3;FALSE);\"找不到\")","v":"B.F."}]
[5344,{"$f":"of:=IFERROR(VLOOKUP([.A75];['file:///D:/公司/公司用/交易部SOP/交易部/權證相關/標的證券/111年度權證標的/標的證券(111Q1_1101230公告)/1101230底稿.xlsx'#上櫃公司基本資料.$A:.$C];3;FALSE);\"找不到\")","v":"VATE"},5383,{"$f":"of:=IFERROR(VLOOKUP([.C75];['file:///D:/公司/公司用/交易部SOP/交易部/權證相關/標的證券/111年度權證標的/標的證券(111Q1_1101230公告)/1101230底稿.xlsx'#上櫃公司基本資料.$A:.$C];3;FALSE);\"找不到\")","v":"KENLY"},5452,{"$f":"of:=IFERROR(VLOOKUP([.E75];['file:///D:/公司/公司用/交易部SOP/交易部/權證相關/標的證券/111年度權證標的/標的證券(111Q1_1101230公告)/1101230底稿.xlsx'#上櫃公司基本資料.$A:.$C];3;FALSE);\"找不到\")","v":"UNIC"}]
[6126,{"$f":"of:=IFERROR(VLOOKUP([.A76];['file:///D:/公司/公司用/交易部SOP/交易部/權證相關/標的證券/111年度權證標的/標的證券(111Q1_1101230公告)/1101230底稿.xlsx'#上櫃公司基本資料.$A:.$C];3;FALSE);\"找不到\")","v":"SINGATRON　"},6127,{"$f":"of:=IFERROR(VLOOKUP([.C76];['file:///D:/公司/公司用/交易部SOP/交易部/權證相關/標的證券/111年度權證標的/標的證券(111Q1_1101230公告)/1101230底稿.xlsx'#上櫃公司基本資料.$A:.$C];3;FALSE);\"找不到\")","v":"LEATEC　"},6170,{"$f":"of:=IFERROR(VLOOKUP([.E76];['file:///D:/公司/公司用/交易部SOP/交易部/權證相關/標的證券/111年度權證標的/標的證券(111Q1_1101230公告)/1101230底稿.xlsx'#上櫃公司基本資料.$A:.$C];3;FALSE);\"找不到\")","v":"WELLDONE　"}]
[6186,{"$f":"of:=IFERROR(VLOOKUP([.A77];['file:///D:/公司/公司用/交易部SOP/交易部/權證相關/標的證券/111年度權證標的/標的證券(111Q1_1101230公告)/1101230底稿.xlsx'#上櫃公司基本資料.$A:.$C];3;FALSE);\"找不到\")","v":"Shin Ruenn"},6207,{"$f":"of:=IFERROR(VLOOKUP([.C77];['file:///D:/公司/公司用/交易部SOP/交易部/權證相關/標的證券/111年度權證標的/標的證券(111Q1_1101230公告)/1101230底稿.xlsx'#上櫃公司基本資料.$A:.$C];3;FALSE);\"找不到\")","v":"LASERTEK"},6217,{"$f":"of:=IFERROR(VLOOKUP([.E77];['file:///D:/公司/公司用/交易部SOP/交易部/權證相關/標的證券/111年度權證標的/標的證券(111Q1_1101230公告)/1101230底稿.xlsx'#上櫃公司基本資料.$A:.$C];3;FALSE);\"找不到\")","v":"C.C.P."}]
[6231,{"$f":"of:=IFERROR(VLOOKUP([.A78];['file:///D:/公司/公司用/交易部SOP/交易部/權證相關/標的證券/111年度權證標的/標的證券(111Q1_1101230公告)/1101230底稿.xlsx'#上櫃公司基本資料.$A:.$C];3;FALSE);\"找不到\")","v":"Insyde"},6538,{"$f":"of:=IFERROR(VLOOKUP([.C78];['file:///D:/公司/公司用/交易部SOP/交易部/權證相關/標的證券/111年度權證標的/標的證券(111Q1_1101230公告)/1101230底稿.xlsx'#上櫃公司基本資料.$A:.$C];3;FALSE);\"找不到\")","v":"Brave Screen"},6651,{"$f":"of:=IFERROR(VLOOKUP([.E78];['file:///D:/公司/公司用/交易部SOP/交易部/權證相關/標的證券/111年度權證標的/標的證券(111Q1_1101230公告)/1101230底稿.xlsx'#上櫃公司基本資料.$A:.$C];3;FALSE);\"找不到\")","v":"CYSTEK"}]
[6654,{"$f":"of:=IFERROR(VLOOKUP([.A79];['file:///D:/公司/公司用/交易部SOP/交易部/權證相關/標的證券/111年度權證標的/標的證券(111Q1_1101230公告)/1101230底稿.xlsx'#上櫃公司基本資料.$A:.$C];3;FALSE);\"找不到\")","v":"TZI"},6667,{"$f":"of:=IFERROR(VLOOKUP([.C79];['file:///D:/公司/公司用/交易部SOP/交易部/權證相關/標的證券/111年度權證標的/標的證券(111Q1_1101230公告)/1101230底稿.xlsx'#上櫃公司基本資料.$A:.$C];3;FALSE);\"找不到\")","v":"Trusval"},6716,{"$f":"of:=IFERROR(VLOOKUP([.E79];['file:///D:/公司/公司用/交易部SOP/交易部/權證相關/標的證券/111年度權證標的/標的證券(111Q1_1101230公告)/1101230底稿.xlsx'#上櫃公司基本資料.$A:.$C];3;FALSE);\"找不到\")","v":"PDK"}]
[6761,{"$f":"of:=IFERROR(VLOOKUP([.A80];['file:///D:/公司/公司用/交易部SOP/交易部/權證相關/標的證券/111年度權證標的/標的證券(111Q1_1101230公告)/1101230底稿.xlsx'#上櫃公司基本資料.$A:.$C];3;FALSE);\"找不到\")","v":"Wendell"},8049,{"$f":"of:=IFERROR(VLOOKUP([.C80];['file:///D:/公司/公司用/交易部SOP/交易部/權證相關/標的證券/111年度權證標的/標的證券(111Q1_1101230公告)/1101230底稿.xlsx'#上櫃公司基本資料.$A:.$C];3;FALSE);\"找不到\")","v":"AMPIRE"},8064,{"$f":"of:=IFERROR(VLOOKUP([.E80];['file:///D:/公司/公司用/交易部SOP/交易部/權證相關/標的證券/111年度權證標的/標的證券(111Q1_1101230公告)/1101230底稿.xlsx'#上櫃公司基本資料.$A:.$C];3;FALSE);\"找不到\")","v":"CONTREL　　"}]
[8091,{"$f":"of:=IFERROR(VLOOKUP([.A81];['file:///D:/公司/公司用/交易部SOP/交易部/權證相關/標的證券/111年度權證標的/標的證券(111Q1_1101230公告)/1101230底稿.xlsx'#上櫃公司基本資料.$A:.$C];3;FALSE);\"找不到\")","v":"FB"},8099,{"$f":"of:=IFERROR(VLOOKUP([.C81];['file:///D:/公司/公司用/交易部SOP/交易部/權證相關/標的證券/111年度權證標的/標的證券(111Q1_1101230公告)/1101230底稿.xlsx'#上櫃公司基本資料.$A:.$C];3;FALSE);\"找不到\")","v":"TSTI　　"},8111,{"$f":"of:=IFERROR(VLOOKUP([.E81];['file:///D:/公司/公司用/交易部SOP/交易部/權證相關/標的證券/111年度權證標的/標的證券(111Q1_1101230公告)/1101230底稿.xlsx'#上櫃公司基本資料.$A:.$C];3;FALSE);\"找不到\")","v":"LIGITEK　"}]
[8431,{"$f":"of:=IFERROR(VLOOKUP([.A82];['file:///D:/公司/公司用/交易部SOP/交易部/權證相關/標的證券/111年度權證標的/標的證券(111Q1_1101230公告)/1101230底稿.xlsx'#上櫃公司基本資料.$A:.$C];3;FALSE);\"找不到\")","v":"SPT"},8933,{"$f":"of:=IFERROR(VLOOKUP([.C82];['file:///D:/公司/公司用/交易部SOP/交易部/權證相關/標的證券/111年度權證標的/標的證券(111Q1_1101230公告)/1101230底稿.xlsx'#上櫃公司基本資料.$A:.$C];3;FALSE);\"找不到\")","v":"IDEAL　　"}]

{"sheet":"'file:///D:/公司/公司用/交易部SOP/交易部/權證相關/標的證券/111年度權證標的/標的證券(111Q1_1101230公告)/1101230底稿.xlsx'#全部","index":2,"n_rows":0,"n_cols":0,"rows_kept":0,"cut":false,"hidden":true,"merged":[]}

{"sheet":"'file:///D:/公司/公司用/交易部SOP/交易部/權證相關/標的證券/111年度權證標的/標的證券(111Q1_1101230公告)/1101230底稿.xlsx'#合乎標準","index":3,"n_rows":0,"n_cols":0,"rows_kept":0,"cut":false,"hidden":true,"merged":[]}

{"sheet":"'file:///D:/公司/公司用/交易部SOP/交易部/權證相關/標的證券/111年度權證標的/標的證券(111Q1_1101230公告)/1101230底稿.xlsx'#111_Q1名單","index":4,"n_rows":0,"n_cols":0,"rows_kept":0,"cut":false,"hidden":true,"merged":[]}

{"sheet":"'file:///D:/公司/公司用/交易部SOP/交易部/權證相關/標的證券/111年度權證標的/標的證券(111Q1_1101230公告)/1101230底稿.xlsx'#111_Q1名單_(英)","index":5,"n_rows":0,"n_cols":0,"rows_kept":0,"cut":false,"hidden":true,"merged":[]}

{"sheet":"'file:///D:/公司/公司用/交易部SOP/交易部/權證相關/標的證券/111年度權證標的/標的證券(111Q1_1101230公告)/1101230底稿.xlsx'#增減名單","index":6,"n_rows":0,"n_cols":0,"rows_kept":0,"cut":false,"hidden":true,"merged":[]}

{"sheet":"'file:///D:/公司/公司用/交易部SOP/交易部/權證相關/標的證券/111年度權證標的/標的證券(111Q1_1101230公告)/1101230底稿.xlsx'#刪除名單原因","index":7,"n_rows":0,"n_cols":0,"rows_kept":0,"cut":false,"hidden":true,"merged":[]}

{"sheet":"'file:///D:/公司/公司用/交易部SOP/交易部/權證相關/標的證券/111年度權證標的/標的證券(111Q1_1101230公告)/1101230底稿.xlsx'#增減名單底稿","index":8,"n_rows":0,"n_cols":0,"rows_kept":0,"cut":false,"hidden":true,"merged":[]}

{"sheet":"'file:///D:/公司/公司用/交易部SOP/交易部/權證相關/標的證券/111年度權證標的/標的證券(111Q1_1101230公告)/1101230底稿.xlsx'#上櫃公司基本資料","index":9,"n_rows":793,"n_cols":3,"rows_kept":793,"cut":false,"hidden":true,"merged":[]}
["公司代號","公司簡稱","英文簡稱"]
[1240,"茂生農經","MORNSUN　"]
[1258,"其祥-KY","Kee Song"]
[1259,"安心","AN-SHIN"]
[1264,"德麥","TEHMAG"]
[1268,"漢來美食","Hi-Lai Foods"]
[1336,"台翰","TAIHAN"]
[1565,"精華","St.Shine　"]
[1569,"濱川","Bin Chuan"]
[1570,"力肯","De Poan"]
[1580,"新麥","SINMAG"]
[1584,"精剛","STC"]
[1586,"和勤","CFTC"]
[1591,"駿吉-KY","INMAX"]
[1593,"祺驊","CHI HUA"]
[1595,"川寶","CBT"]
[1599,"宏佳騰","AEON"]
[1742,"台蠟","TWC"]
[1752,"南光","NANG KUANG　　"]
[1777,"生泰","SYN-TECH"]
[1781,"合世","H&L"]
[1784,"訊聯","BIONET CORP."]
[1785,"光洋科","Solar"]
[1788,"杏昌","HCI"]
[1796,"金穎生技","GeneFerm"]
[1799,"易威","EASYWELL"]
[1813,"寶利徠","Polylite"]
[1815,"富喬","FFG"]
[2035,"唐榮公司","TE　　"]
[2061,"風青","FENG CHING"]
[2063,"世鎧","SHEH KAI"]
[2064,"晉椿","CAMELLIA"]
[2065,"世豐","SF"]
[2066,"世德","SUMEEKO"]
[2067,"嘉鋼","CYSTEEL"]
[2070,"精湛","Ching Chan"]
[2221,"大甲","YHMCO　"]
[2230,"泰茂","C.T.I."]
[2235,"謚源","I YUAN"]
[2596,"綠意","ReaLy"]
[2640,"大車隊","TaiwanTaxi"]
[2641,"正德","Franbo Lines"]
[2643,"捷迅","Soonest"]
[2718,"晶悅","PH"]
[2719,"燦星旅","Star Travel"]
[2724,"富驛-KY","FX HOTELS"]
[2726,"雅茗-KY","Yummy Town"]
[2729,"瓦城","TTFB"]
[2732,"六角","La Kaffa"]
[2734,"易飛網","Ezfly"]
[2736,"高野","HOYA"]
[2740,"天蔥","Mr. Onion"]
[2743,"山富","Richmond"]
[2745,"五福","LIFE TRAVEL"]
[2752,"豆府","TOFU"]
[2754,"亞洲藏壽司","KURA SUSHI ASIA"]
[2755,"揚秦","YoungQin"]
[2916,"滿心","MUNSIN　"]
[2924,"東凌-KY","Tung Ling"]
[2926,"誠品生活","Eslite Spectrum"]
[2928,"紅馬-KY","RHGroup"]
[2937,"集雅社","Gseven"]
[3064,"泰偉","Astro Corp.　　"]
[3066,"李洲","TAIWAN OASIS　"]
[3067,"全域","　　Phonic"]
[3071,"協禧","ADDA　"]
[3073,"天方能源","Teamphon"]
[3078,"僑威","CWT　　"]
[3081,"聯亞","LandMark"]
[3083,"網龍","CHINESEGAMER"]
[3085,"新零售","NEWRETAIL"]
[3086,"華義","WAYI　　"]
[3088,"艾訊","AXIOMTEK"]
[3089,"元炬","YUAN JIU INC."]
[3093,"港建","TKK　"]
[3095,"及成","CCC"]
[3105,"穩懋","WIN　　"]
[3114,"好德","　　HT"]
[3115,"寶島極","TSC　　"]
[3118,"進階","LEVEL"]
[3122,"笙泉","Megawin　"]
[3128,"昇銳","HI SHARP"]
[3131,"弘塑","GPTC"]
[3141,"晶宏","UltraChip"]
[3144,"新揚科","ThinFlex"]
[3147,"大綜","JETWELL　　"]
[3152,"璟德","ACX"]
[3162,"精確","UAT"]
[3163,"波若威","Browave　　"]
[3169,"亞信","ASIX　　"]
[3171,"新洲","XIN CHIO 　　"]
[3176,"基亞","MEDIGEN　　"]
[3178,"公準","GONGIN"]
[3188,"鑫龍騰","GLTD"]
[3191,"和進","HOLD JINN　"]
[3202,"樺晟","HIGH-TEK"]
[3205,"佰研","SLS"]
[3206,"志豐","KINGSTATE"]
[3207,"耀勝","YAO SHENG"]
[3211,"順達","Dynapack"]
[3213,"茂訊","Mildef"]
[3217,"優群","ARGOSY"]
[3218,"大學光","UNIVERSAL"]
[3219,"倚強科","Aethertek"]
[3221,"台嘉碩","TST"]
[3224,"三顧","MetaTech"]
[3226,"至寶電","TOPOWER"]
[3227,"原相","PXI"]
[3228,"金麗科","RDC"]
[3230,"錦明","Jiin Ming"]
[3232,"昱捷","SIC"]
[3234,"光環","TrueLight"]
[3236,"千如","ABC"]
[3252,"海灣","Haiwan"]
[3259,"鑫創","3S"]
[3260,"威剛","ADATA"]
[3264,"欣銓","Ardentec"]
[3265,"台星科","WST"]
[3268,"海德威","Higher Way"]
[3272,"東碩","GW"]
[3276,"宇環","tht"]
[3284,"太普高","TOP"]
[3285,"微端","MT"]
[3287,"廣寰科","Kworld"]
[3288,"點晶","SiTI"]
[3289,"宜特","IST"]
[3290,"東浦","DONPON"]
[3293,"鈊象","IGS"]
[3294,"英濟","Megaforce"]
[3297,"杭特","Hunt"]
[3303,"岱稜","UNIVACCO"]
[3306,"鼎天","RoyalTek"]
[3310,"佳穎","CHIALIN"]
[3313,"斐成","FCE"]
[3317,"尼克森","NIKO-SEM"]
[3322,"建舜電","JEM"]
[3323,"加百裕","Celxpert"]
[3324,"雙鴻","AURAS"]
[3325,"旭品","Casing"]
[3332,"幸康","CINCON"]
[3339,"泰谷","TEKCORE"]
[3354,"律勝","MICROCOSM"]
[3357,"臺慶科","TAI-TECH"]
[3360,"尚立","SUNNIC"]
[3362,"先進光","ABILITY"]
[3363,"上詮","FOCI"]
[3372,"典範","TICP"]
[3373,"熱映","Radiant"]
[3374,"精材","Xintec"]
[3379,"彬台","TBC"]
[3388,"崇越電","TTC"]
[3390,"旭軟","SUNFLEX"]
[3402,"漢科","WHOLETECH"]
[3426,"台興","TSE"]
[3434,"哲固","ACULA"]
[3438,"類比科","AAT"]
[3441,"聯一光","UNIQUE"]
[3444,"利機","NICHING"]
[3455,"由田","UTECHZONE"]
[3465,"進泰電子","NAE"]
[3466,"致振","SKARDIN"]
[3479,"安勤","Avalue"]
[3483,"力致","FCN"]
[3484,"崧騰","SOLTEAM"]
[3489,"森寶","Sun Brothers"]
[3490,"單井","singlewell"]
[3491,"昇達科","UMT"]
[3492,"長盛","ACT"]
[3498,"陽程","USUN"]
[3499,"環天科","GLOBALSAT"]
[3508,"位速","Ways"]
[3511,"矽瑪","SIMULA TECH INC"]
[3512,"皇龍","Huang Long"]
[3516,"亞帝歐","ADO"]
[3520,"華盈","JVE"]
[3521,"鴻翊","DataVan"]
[3522,"御頂","TOPLUS"]
[3523,"迎輝","EFUN"]
[3526,"凡甲","ALLTOP"]
[3527,"聚積","MBI"]
[3529,"力旺","eMemory"]
[3531,"先益","Shian Yih"]
[3537,"堡達","PODAK"]
[3540,"曜越","Thermaltake"]
[3541,"西柏","CYP"]
[3546,"宇峻","USERJOY"]
[3548,"兆利","JARLLY"]
[3551,"世禾","SHT"]
[3552,"同致","TUNG THIH"]
[3555,"重鵬","IROC"]
[3556,"禾瑞亞","EETI"]
[3558,"神準","Senao Networks"]
[3564,"其陽","AEWIN"]
[3567,"逸昌","ETREND"]
[3570,"大塚","OITC"]
[3577,"泓格","ICP DAS"]
[3580,"友威科","UVAT"]
[3581,"博磊","ZVC"]
[3587,"閎康","MA-tek"]
[3594,"磐儀","ARBOR"]
[3597,"映興","AVI"]
[3609,"東林","HEP"]
[3611,"鼎翰","TSC AUTO ID"]
[3615,"安可","AimCore"]
[3623,"富晶通","TTI"]
[3624,"光頡","VIKING"]
[3625,"西勝","C-TECH"]
[3628,"盈正","ABLEREX"]
[3629,"地心引力","Gravitytai"]
[3630,"新鉅科","NEWMAX"]
[3631,"晟楠","CHERNAN"]
[3632,"研勤","PAPAGO"]
[3642,"駿熠電","Unitel"]
[3646,"艾恩特","ANT"]
[3652,"精聯","Unitech elec."]
[3663,"鑫科","TTMC"]
[3664,"安瑞-KY","Array"]
[3666,"光耀","OTI"]
[3672,"康聯訊","CTS"]
[3675,"德微","Eris Tech"]
[3680,"家登","Gudeng"]
[3684,"榮昌","Grand-Tek"]
[3685,"元創精密","TAC"]
[3687,"歐買尬","OMG"]
[3689,"湧德","UDE"]
[3691,"碩禾","GIGASOLAR"]
[3693,"營邦","AIC"]
[3707,"漢磊","EPISIL"]
[3709,"鑫聯大投控","Trigold"]
[3710,"連展投控","ACON Holding"]
[3713,"新晶投控","HsinjingHolding"]
[4102,"永日","YUNGZIP　"]
[4105,"東洋","TTY　"]
[4107,"邦特","BIOTEQUE"]
[4109,"加捷生醫","Jia Jie Bio"]
[4111,"濟生","CHI  SHENG 　"]
[4113,"聯上","WE&WIN"]
[4114,"健喬","SYNMOSA"]
[4116,"明基醫","BMTC　　"]
[4120,"友華","OEP"]
[4121,"優盛","ROSSMAX"]
[4123,"晟德","Center Lab."]
[4126,"太醫","PAHSCO　　"]
[4127,"天良","TLB"]
[4128,"中天","MICROBIO　　"]
[4129,"聯合","UOC　　"]
[4130,"健亞","GBL"]
[4131,"晶宇","DR.Chip"]
[4138,"曜亞","DMT"]
[4139,"馬光-KY","KY M.K."]
[4147,"中裕","TMB"]
[4152,"台微體","TLC"]
[4153,"鈺緯","DIVA Labs."]
[4154,"康樂-KY","Kino"]
[4157,"太景*-KY","TAIGEN"]
[4160,"創源","GGA Corp."]
[4161,"聿新科","BIOPTIK"]
[4162,"智擎","PEI"]
[4163,"鐿鈦","INTAI"]
[4167,"松瑞藥","SLC"]
[4168,"醣聯","GlycoNex Inc."]
[4171,"瑞基","GeneReach"]
[4173,"久裕","ARICH"]
[4174,"浩鼎","OBI"]
[4175,"杏一","MedFirst"]
[4183,"福永生技","EPS Bio"]
[4188,"安克","AmCad"]
[4192,"杏國","SynCore"]
[4198,"欣大健康","S&S"]
[4205,"中華食","CHUNG HWA 　"]
[4207,"環泰","TFC"]
[4303,"信立","HSINLI"]
[4304,"勝昱","SUNVIC"]
[4305,"世坤","SKP"]
[4401,"東隆興","TLOONG　　"]
[4402,"福大","FU TA　　"]
[4406,"新昕纖","HSIN-SIN"]
[4413,"飛寶企業","EST"]
[4416,"三圓","SHANYUAN 　"]
[4417,"金洲","KING CHOU"]
[4419,"元勝","ESG"]
[4420,"光明","Kwang Ming"]
[4429,"聚紡","G-FUN"]
[4430,"耀億","YAO I"]
[4432,"銘旺實","Haksport"]
[4433,"興采","Singtex"]
[4502,"健信","RT"]
[4503,"金雨","GOLD RAIN　"]
[4506,"崇友","GFC　　"]
[4510,"高鋒","KAFO　　"]
[4513,"福裕","FALCON　"]
[4523,"永彰","TWNCAL　　"]
[4527,"方土霖","KL　"]
[4528,"江興鍛","CHF　"]
[4529,"淳紳","EPTECH"]
[4530,"宏易","Honyi"]
[4533,"協易機","SEYI"]
[4534,"慶騰","trinity"]
[4535,"至興","FBT"]
[4538,"大詠城","WINSON"]
[4541,"晟田","Magnate"]
[4542,"科嶠","ANT"]
[4543,"萬在","MAN ZAI"]
[4549,"桓達","FineTek"]
[4550,"長佳","CJME"]
[4554,"橙的","Orange"]
[4556,"旭然","BSI"]
[4561,"健椿","Kenturn"]
[4563,"百德","QUASER"]
[4568,"科際精密","KOGE"]
[4580,"捷流閥業","Value Valves"]
[4609,"唐鋒","AIRLUX"]
[4702,"中美實","ALLIED 　　"]
[4706,"大恭","TKC　　"]
[4707,"磐亞","PACC　　"]
[4711,"永純","YONG SHUN　　"]
[4712,"南璋","NT"]
[4714,"永捷","UB　　"]
[4716,"大立","DAILY　　"]
[4721,"美琪瑪","mechema　"]
[4726,"永昕","Mycenax"]
[4728,"雙美","SunMax"]
[4729,"熒茂","MILDEX"]
[4735,"豪展","Avita"]
[4736,"泰博","TaiDoc"]
[4741,"泓瀚","Jetbest"]
[4743,"合一","ONENESS BIOTECH"]
[4744,"皇將","CVC"]
[4745,"合富-KY","CMH"]
[4747,"強生","JCP"]
[4754,"國碳科","INCA"]
[4760,"勤凱科技","ample"]
[4767,"誠泰科技","CHETAY"]
[4803,"VHQ-KY","VHQ-KY"]
[4804,"大略-KY","Da Lue"]
[4806,"昇華","Shec"]
[4903,"聯光通","UFOC"]
[4905,"台聯電","TAINET"]
[4907,"富宇","Fu Yu  Property"]
[4908,"前鼎","APAC"]
[4909,"新復興","NEE"]
[4911,"德英","G&E"]
[4924,"欣厚-KY","HTM"]
[4931,"新盛力","STL"]
[4933,"友輝","UBRIGHT"]
[4939,"亞電","AEM"]
[4944,"兆遠","CRYSTALWISE"]
[4945,"陞達科技","Sentelic"]
[4946,"辣椒","Cayenne Tech"]
[4950,"牧東","Mutto"]
[4953,"緯軟","WITS"]
[4966,"譜瑞-KY","Parade"]
[4971,"IET-KY","IET"]
[4972,"湯石照明","TONS"]
[4973,"廣穎","Silicon Power"]
[4974,"亞泰","ATII"]
[4979,"華星光","LuxNet"]
[4987,"科誠","GODEX"]
[4991,"環宇-KY","GCS"]
[4995,"晶達","Litemax"]
[5009,"榮剛","GMTC　"]
[5011,"久陽","OFCO　"]
[5013,"強新","NEW BEST"]
[5014,"建錩","CCI　　"]
[5015,"華祺","RODEX　　"]
[5016,"松和","Song Ho"]
[5102,"富強","FU CHIAN　"]
[5201,"凱衛","KWAY"]
[5202,"力新","NewSoft　　"]
[5205,"中茂","TWGET　　"]
[5206,"坤悅","Kunyue"]
[5209,"新鼎","CTCI ASI"]
[5210,"寶碩","APEX"]
[5211,"蒙恬","Penpower"]
[5212,"凌網","HYWEB　　"]
[5213,"亞昕","YeaShin"]
[5220,"萬達光電","HIGGSTEC"]
[5223,"安力-KY","Anli"]
[5227,"立凱-KY","Aleees"]
[5230,"雷笛克光學","Ledlink"]
[5236,"凌陽創新","Sunplusit"]
[5245,"智晶","WSI"]
[5251,"天鉞電","JSW"]
[5263,"智崴","BROGENT"]
[5272,"笙科","AMICCOM"]
[5274,"信驊","ASPEED"]
[5276,"達輝-KY","Da Hui"]
[5278,"尚凡","Sunfun"]
[5281,"大峽谷-KY","StrongLED"]
[5287,"數字","ADDCN"]
[5289,"宜鼎","Innodisk"]
[5291,"邑昇","EISO"]
[5299,"杰力","EMC"]
[5301,"寶得利","CJW"]
[5302,"太欣","STK　"]
[5306,"桂盟","KMC"]
[5309,"系統電","SG　"]
[5310,"天剛","CGS"]
[5312,"寶島科","FORMOSA"]
[5314,"世紀","Myson"]
[5315,"光聯","U.R.T."]
[5321,"友銓","B.F."]
[5324,"士開","SDC　"]
[5328,"華容","HJC　"]
[5340,"建榮","BAOTEK"]
[5344,"立衛","VATE"]
[5345,"天揚","Team Young　"]
[5347,"世界","VIS"]
[5348,"系通","TSI　　"]
[5351,"鈺創","Etron　　"]
[5353,"台林","Tailyn　　"]
[5355,"佳總","PSC"]
[5356,"協益","SIRTEC　"]
[5364,"力麗店","LEALEA HOTELS"]
[5371,"中光電","Coretronic　"]
[5381,"合正","UNIPLUS　　"]
[5383,"金利","KENLY"]
[5386,"青雲","ALBATRON　　"]
[5392,"應華","AVY"]
[5398,"慕康生醫","INALWAYS　　"]
[5403,"中菲","DDSC　"]
[5410,"國眾","LEO"]
[5425,"台半","TSC　　"]
[5426,"振發","CF　"]
[5432,"達威","DATA VISION　"]
[5438,"東友","TIS"]
[5439,"高技","FHt"]
[5443,"均豪","GPM"]
[5450,"南良","NAMLIONG"]
[5452,"佶優","UNIC"]
[5455,"昇益","SY"]
[5457,"宣德","SPEED TECH　"]
[5460,"同協","MUSTANG"]
[5464,"霖宏","LIN HORN"]
[5465,"富驊","LFE"]
[5468,"凱鈺","TMTECH"]
[5474,"聰泰","YUAN"]
[5475,"德宏","GLOTECH　　"]
[5478,"智冠","SOFT-WORLD　　"]
[5481,"新華","SINOTACT"]
[5483,"中美晶","SAS　　"]
[5487,"通泰","TONTEK　"]
[5488,"松普","SP"]
[5489,"彩富","DYNACOLOR"]
[5490,"同亨","XAC　　"]
[5493,"三聯","Sanlien"]
[5498,"凱崴","KEY WARE　"]
[5508,"永信建","YCDC　"]
[5511,"德昌","TE  CHANG　"]
[5512,"力麒","RICH　　"]
[5514,"三豐","SUN FON"]
[5516,"雙喜","SUN-SEA"]
[5520,"力泰","Lihtai"]
[5523,"豐謙","FONG CHIEN"]
[5529,"志嘉","Well Glory　　"]
[5530,"龍巖","LUNG YEN"]
[5536,"聖暉","ACTER"]
[5543,"桓鼎-KY","Buima"]
[5601,"台聯櫃","TACT　"]
[5603,"陸海","SEA&LAND"]
[5604,"中連貨","CLTC　"]
[5609,"中菲行","DIMERCO"]
[5701,"劍湖山","JFS"]
[5703,"亞都麗緻","Landis Taipei　"]
[5704,"老爺知","Chihpen Royal"]
[5820,"日盛金","JIHSUN FHC　　"]
[5864,"致和證","CIS　"]
[5878,"台名","TABC"]
[5902,"德記","Tait"]
[5903,"全家","FamilyMart　　"]
[5904,"寶雅","Poya　　"]
[5905,"南仁湖","NRL"]
[6015,"宏遠證","HORIZON Sec."]
[6016,"康和證","concords　　"]
[6020,"大展證","TACHAN"]
[6021,"大慶證","TA CHING"]
[6023,"元大期貨","Yuanta Futures"]
[6026,"福邦證","GFS"]
[6101,"寬魚國際","KIC"]
[6103,"合邦","AVID"]
[6104,"創惟","GLI"]
[6109,"亞元","AtechOEM"]
[6111,"大宇資","SOFTSTAR"]
[6113,"亞矽","ASEC"]
[6114,"久威","JUIC"]
[6118,"建達","Xander　　"]
[6121,"新普","SMP　"]
[6122,"擎邦","KPEC　　"]
[6123,"上奇","GrandTech 　"]
[6124,"業強","YCTC"]
[6125,"廣運","KENMEC　"]
[6126,"信音","SINGATRON　"]
[6127,"九豪","LEATEC　"]
[6129,"普誠","PTC　　"]
[6130,"星寶國際","SIC"]
[6134,"萬旭","WSC"]
[6138,"茂達","ANPEC"]
[6140,"訊達電腦","DIMENSION"]
[6143,"振曜","NETRONIX,INC."]
[6144,"得利影","DMT"]
[6146,"耕興","SPORTON　　"]
[6147,"頎邦","CHIPBOND　"]
[6148,"驊宏資","AZION"]
[6150,"撼訊","Tul"]
[6151,"晉倫","GINAR　　"]
[6154,"順發","Sunfar　　"]
[6156,"松上","SONG SHANG　　"]
[6158,"禾昌","P-TWO　　"]
[6160,"欣技","Cipherlab　"]
[6161,"捷波","JETWAY　"]
[6163,"華電網","HWACOM　　"]
[6167,"久正","POWERTIP"]
[6169,"昱泉","InterServ"]
[6170,"統振","WELLDONE　"]
[6171,"亞銳士","Aries　　"]
[6173,"信昌電","P.D.C.　"]
[6174,"安碁","AKER　　"]
[6175,"立敦","LITON"]
[6179,"亞通","ATE ENERGY.INC"]
[6180,"橘子","GAMANIA"]
[6182,"合晶","WAFER WORKS"]
[6185,"幃翔","PLASTRON"]
[6186,"新潤","Shin Ruenn"]
[6187,"萬潤","ALL RING"]
[6188,"廣明","QSI　"]
[6190,"萬泰科","WONDERFUL　　"]
[6194,"育富","YUFO"]
[6195,"詩肯","SCAN-D"]
[6198,"凌泰","AVERLOGIC"]
[6199,"天品","TienPin"]
[6203,"海韻電","Sea Sonic"]
[6204,"艾華","ALPHA"]
[6207,"雷科","LASERTEK"]
[6208,"日揚","Htc"]
[6210,"慶生","KINTECH"]
[6212,"理銘","LI MING"]
[6217,"中探針","C.C.P."]
[6218,"豪勉","Hauman"]
[6219,"富旺","FULL WANG"]
[6220,"岳豐","YFC-BONEAGLE"]
[6221,"晉泰","Genesis　"]
[6222,"上揚","Sotac"]
[6223,"旺矽","MPI"]
[6227,"茂綸","Macnica Galaxy"]
[6228,"全譜","PIE"]
[6229,"研通","V-TAC"]
[6231,"系微","Insyde"]
[6233,"旺玖","PROLIFIC"]
[6234,"高僑","TERA AUTO"]
[6236,"康呈","CTB"]
[6237,"驊訊","CMEI"]
[6240,"松崗","Sung  Gang"]
[6241,"易通展","AMIGO　"]
[6242,"立康","LI KANG"]
[6244,"茂迪","MOTECH"]
[6245,"立端","Lanner　"]
[6246,"臺龍","TTFIC"]
[6247,"淇譽電","JAZZ SPEAKERS　"]
[6248,"沛波","TMP"]
[6259,"百徽","BULLWILL"]
[6261,"久元","YTEC"]
[6263,"普萊德","Planet"]
[6264,"富裔","KL"]
[6265,"方土昶","KCU"]
[6266,"泰詠","TOP UNION　　"]
[6270,"倍微","PCT"]
[6274,"台燿","tuc"]
[6275,"元山","Y.S.TECH"]
[6276,"安鈦克","Antec"]
[6279,"胡連","HU LANE　"]
[6284,"佳邦","INPAQ　　"]
[6287,"元隆","AMPI　　"]
[6290,"良維","LONGWELL　　"]
[6291,"沛亨","AIC"]
[6292,"迅德","AXIS"]
[6294,"智基","Tekom"]
[6404,"通訊-KY","CCMG"]
[6411,"晶焱","Amazing"]
[6417,"韋僑","SAG"]
[6418,"詠昇","Y-S ELEC."]
[6419,"京晨科","NUUO"]
[6425,"易發","EFC"]
[6432,"今展科","ARLITECH"]
[6435,"大中","Sinopower"]
[6441,"廣錠","IBG"]
[6446,"藥華藥","PEC"]
[6457,"紘康","HYCON"]
[6461,"益得","Intech"]
[6462,"神盾","EGIS"]
[6465,"威潤","ATrack"]
[6469,"大樹","Great Tree"]
[6470,"宇智","U-MEDIA"]
[6472,"保瑞","Bora"]
[6482,"弘煜科","FUN YOURS"]
[6485,"點序","ASolid"]
[6486,"互動","IDT"]
[6488,"環球晶","GWC"]
[6492,"生華科","SH"]
[6494,"九齊","Nyquest"]
[6496,"科懋","Excelsior"]
[6499,"益安","Medeon"]
[6506,"雙邦","SBI　　"]
[6508,"惠光","HKC　　"]
[6509,"聚和","HOPAX　"]
[6510,"精測","CHPT"]
[6512,"啟發電","GoMax"]
[6514,"芮特-KY","RTI"]
[6516,"勤崴國際","KINGWAY"]
[6523,"達爾膚","DR.WU"]
[6527,"明達醫","Crystalvue"]
[6530,"創威","Axcen"]
[6532,"瑞耘","CT"]
[6535,"順藥","LUMOSA"]
[6538,"倉和","Brave Screen"]
[6542,"隆中","GAMESPARCS"]
[6547,"高端疫苗","MVC"]
[6548,"長科*","CWTC"]
[6556,"勝品","Topview"]
[6560,"欣普羅","APPROPHO"]
[6561,"是方","Chief"]
[6568,"宏觀","Rafael Micro"]
[6569,"醫揚","onyx"]
[6570,"維田","APLEX"]
[6574,"霈方","MIKOBEAUTE"]
[6576,"逸達","Foresee"]
[6577,"勁豐","PSC"]
[6578,"達邦蛋白","DaBomb"]
[6588,"東典","EOC"]
[6589,"台康生技","EirGenix"]
[6590,"普鴻","Provision"]
[6593,"台灣銘板","TNP"]
[6594,"展匯科","Alcorlink Corp."]
[6596,"寬宏藝術","KHAM Inc."]
[6603,"富強鑫","FCS"]
[6609,"瀧澤科","TTT"]
[6612,"奈米醫材","ICARES"]
[6613,"朋億","Novatech"]
[6615,"慧智","SOFIVA"]
[6616,"特昇-KY","TIL"]
[6624,"萬年清","EC"]
[6629,"泰金-KY","TK-KY"]
[6640,"均華","GMM"]
[6642,"富致","FUZETEC"]
[6643,"M31","M31"]
[6649,"台生材","TWBM"]
[6651,"全宇昕","CYSTEK"]
[6654,"天正國際","TZI"]
[6661,"威健生技","WELGENE"]
[6662,"樂斯科","BioLASCO"]
[6664,"群翊","Group Up"]
[6667,"信紘科","Trusval"]
[6679,"鈺太","ZILLTEK"]
[6680,"鑫創電子","SINTRONES"]
[6683,"雍智科技","KSMT"]
[6684,"安格","AlgolTek"]
[6690,"安碁資訊","ACSI"]
[6697,"東捷資訊","ITTS"]
[6703,"軒郁","SHINY"]
[6712,"長聖","Ever Supreme"]
[6716,"應廣","PDK"]
[6727,"亞泰金屬","AMI"]
[6728,"上洋","UP YOUNG"]
[6732,"昇佳電子","sensortek"]
[6733,"博晟生醫","BioGend"]
[6741,"91APP*-KY","91APP"]
[6747,"亨泰光","BTOX"]
[6751,"智聯服務","AST"]
[6752,"叡揚","GSS"]
[6761,"穩得","Wendell"]
[6762,"達亞","Delta Asia"]
[6767,"台微醫","Wiltrom"]
[6788,"華景電","Brillian"]
[6803,"崑鼎","ECOVE Corp."]
[7402,"邑錡","Brinno"]
[7556,"意德士科技","YEEDEX"]
[8024,"佑華","Alpha"]
[8027,"鈦昇","E&R"]
[8032,"光菱","KORYO"]
[8034,"榮群","OPNET"]
[8038,"長園科","CAEC"]
[8040,"九暘","IC+　"]
[8042,"金山電","CHINSAN"]
[8043,"蜜望實","3H"]
[8044,"網家","PChome online"]
[8047,"星雲","GCC　"]
[8048,"德勝","RUBYTECH　"]
[8049,"晶采","AMPIRE"]
[8050,"廣積","IBASE　　"]
[8054,"安國","Alcor Micro"]
[8059,"凱碩","CTI"]
[8064,"東捷","CONTREL　　"]
[8066,"來思達","LIFESTYLE"]
[8067,"志旭","Gish INT"]
[8068,"全達","Chander　　"]
[8069,"元太","EIH"]
[8071,"能率網通","ABICO"]
[8074,"鉅橡","AURONA"]
[8076,"伍豐","FIRICH　　"]
[8077,"洛碁","GWH"]
[8080,"永利聯合","OST"]
[8083,"瑞穎","TIC"]
[8084,"巨虹","CHIP HOPE　　"]
[8085,"福華","FD　　"]
[8086,"宏捷科","AWSC　　"]
[8087,"華鎂鑫","HM　"]
[8088,"品安","PANRAM"]
[8089,"康全電訊","Comtrend"]
[8091,"翔名","FB"]
[8092,"建暐","CWPT　　"]
[8093,"保銳","ENERMAX"]
[8096,"擎亞","CoAsia"]
[8097,"常珵","ATW"]
[8099,"大世科","TSTI　　"]
[8107,"大億金茂","KENMOS"]
[8109,"博大","P-DUKE　"]
[8111,"立碁","LIGITEK　"]
[8121,"越峰","ACME"]
[8147,"正淩","NEXTRON"]
[8155,"博智","ACCL　"]
[8171,"天宇","Formosa"]
[8176,"智捷","ZCOM"]
[8182,"加高","HELE　"]
[8183,"精星","ITC"]
[8234,"新漢","NEXCOM　　"]
[8240,"華宏","WAH HONG　　"]
[8255,"朋程","ATC　"]
[8277,"商丞","UNIFOSA"]
[8279,"生展","SYNGEN"]
[8284,"三竹","MITAKE　　"]
[8289,"泰藝","Taitien"]
[8291,"尚茂","SMT"]
[8299,"群聯","Phison"]
[8342,"益張","I  JANG　　"]
[8349,"恒耀國際","QST"]
[8354,"冠好","KH　　"]
[8358,"金居","CO-TECH"]
[8383,"千附","ChenFull"]
[8390,"金益鼎","JYD"]
[8401,"白紗科","BAI SHA"]
[8403,"盛弘","SHAREHOPE"]
[8406,"金可-KY","GINKO"]
[8409,"商之器","EBM"]
[8410,"森田","Sen Tien"]
[8415,"大國鋼","Brighton-Best"]
[8416,"實威","SWTC"]
[8418,"捷必勝-KY","JPNH"]
[8420,"明揚","LAUNCH TECH"]
[8421,"旭源","XYP"]
[8423,"保綠-KY","Polygreen"]
[8424,"惠普","WELLPOOL"]
[8426,"紅木-KY","Redwood"]
[8431,"匯鑽科","SPT"]
[8432,"東生華","TSH"]
[8433,"弘帆","BON FAME"]
[8435,"鉅邁","Zimmite"]
[8436,"大江","TCI"]
[8437,"大地-KY","Dadi"]
[8440,"綠電","E＆E"]
[8444,"綠河-KY","Green River"]
[8446,"華研","HIM Music"]
[8450,"霹靂","PILI"]
[8455,"大拓-KY","Daito ME"]
[8472,"夠麻吉","GOMAJI"]
[8476,"台境","TESC"]
[8477,"創業家","KUOBROTHERS"]
[8489,"三貝德","Samebest"]
[8905,"裕國","ECS"]
[8906,"花王","Forward　"]
[8908,"欣雄","SHIN HSIUNG　　"]
[8916,"光隆","KLF　"]
[8917,"欣泰","HTGas"]
[8921,"沈氏","SHEN'S ART"]
[8923,"時報","C.T.Publishing"]
[8924,"大田","O-TA"]
[8927,"北基","Pei Chi　"]
[8928,"鉅明","DYNAMIC　　"]
[8929,"富堡","FBIC　　"]
[8930,"青鋼","CKM　"]
[8931,"大汽電","TYC　"]
[8932,"宏大","MAX ZIPPER"]
[8933,"愛地雅","IDEAL　　"]
[8935,"邦泰","PONTEX"]
[8936,"國統","KTI"]
[8937,"合騏","HER CHEE"]
[8938,"明安","ADVANCED  GROUP"]
[8941,"關中","GRAND HALL"]
[8942,"森鉅","Xxentria　"]
[911613,"特藝-DR","TechOil&Gas"]
[9949,"琉園","TITTOT"]
[9950,"萬國通","EMINENT"]
[9951,"皇田","MACAUTO"]
[9960,"邁達康","DACOME"]
[9962,"有益","YYS"]